Uploaded image for project: 'JDK'
  1. JDK
  2. JDK-8191616

[TEST_BUG] : sanity/client/SwingSet/src/SliderDemoTest.java: Failed with TimeoutExpiredException: Wait "Wait till Slider attains the specified state."

    XMLWordPrintable

    Details

    • Subcomponent:
    • Resolved In Build:
      b34
    • CPU:
      generic
    • OS:
      linux

      Description

      java version "10-ea"
      Java(TM) SE Runtime Environment (build 10-ea+24)
      Java HotSpot(TM) 64-Bit Server VM (build 10-ea+24, mixed mode)

      Linux 3.8.13-35.3.1.el7uek.x86_64 (amd64)

      test SliderDemoTest.test(): failure
      org.netbeans.jemmy.TimeoutExpiredException: Wait "Wait till Slider attains the specified state." state to be reached (ComponentOperator.WaitStateTimeout)
      at org.netbeans.jemmy.Waiter.waitAction(Waiter.java:208)
      at org.netbeans.jemmy.operators.Operator.waitState(Operator.java:714)
      at SliderDemoTest.waitSliderValue(SliderDemoTest.java:192)
      at SliderDemoTest.checkKeyPress(SliderDemoTest.java:187)
      at SliderDemoTest.checkKeyboard(SliderDemoTest.java:145)
      at SliderDemoTest.plain(SliderDemoTest.java:85)
      at SliderDemoTest.test(SliderDemoTest.java:71)
      at java.base/jdk.internal.reflect.NativeMethodAccessorImpl.invoke0(Native Method)
      at java.base/jdk.internal.reflect.NativeMethodAccessorImpl.invoke(NativeMethodAccessorImpl.java:62)
      at java.base/jdk.internal.reflect.DelegatingMethodAccessorImpl.invoke(DelegatingMethodAccessorImpl.java:43)
      at java.base/java.lang.reflect.Method.invoke(Method.java:564)
      at org.testng.internal.MethodInvocationHelper.invokeMethod(MethodInvocationHelper.java:85)
      at org.testng.internal.Invoker.invokeMethod(Invoker.java:639)
      at org.testng.internal.Invoker.invokeTestMethod(Invoker.java:821)
      at org.testng.internal.Invoker.invokeTestMethods(Invoker.java:1131)
      at org.testng.internal.TestMethodWorker.invokeTestMethods(TestMethodWorker.java:124)
      at org.testng.internal.TestMethodWorker.run(TestMethodWorker.java:108)
      at org.testng.TestRunner.privateRun(TestRunner.java:773)
      at org.testng.TestRunner.run(TestRunner.java:623)
      at org.testng.SuiteRunner.runTest(SuiteRunner.java:357)
      at org.testng.SuiteRunner.runSequentially(SuiteRunner.java:352)
      at org.testng.SuiteRunner.privateRun(SuiteRunner.java:310)
      at org.testng.SuiteRunner.run(SuiteRunner.java:259)
      at org.testng.SuiteRunnerWorker.runSuite(SuiteRunnerWorker.java:52)
      at org.testng.SuiteRunnerWorker.run(SuiteRunnerWorker.java:86)
      at org.testng.TestNG.runSuitesSequentially(TestNG.java:1185)
      at org.testng.TestNG.runSuitesLocally(TestNG.java:1110)
      at org.testng.TestNG.run(TestNG.java:1018)
      at com.sun.javatest.regtest.agent.TestNGRunner.main(TestNGRunner.java:94)
      at com.sun.javatest.regtest.agent.TestNGRunner.main(TestNGRunner.java:54)
      at java.base/jdk.internal.reflect.NativeMethodAccessorImpl.invoke0(Native Method)
      at java.base/jdk.internal.reflect.NativeMethodAccessorImpl.invoke(NativeMethodAccessorImpl.java:62)
      at java.base/jdk.internal.reflect.DelegatingMethodAccessorImpl.invoke(DelegatingMethodAccessorImpl.java:43)
      at java.base/java.lang.reflect.Method.invoke(Method.java:564)
      at com.sun.javatest.regtest.agent.MainWrapper$MainThread.run(MainWrapper.java:115)
      at java.base/java.lang.Thread.run(Thread.java:844)

      ===============================================
      sanity/client/SwingSet/src/SliderDemoTest.java
      Total tests run: 1, Failures: 1, Skips: 0
      ===============================================

      ----------System.err:(16/1028)----------
      Error:
      "Wait "Wait till Slider attains the specified state." state to be reached (ComponentOperator.WaitStateTimeout)" action has not been produced in 60006 milliseconds
      java.lang.Exception: failures: 1
      at com.sun.javatest.regtest.agent.TestNGRunner.main(TestNGRunner.java:96)
      at com.sun.javatest.regtest.agent.TestNGRunner.main(TestNGRunner.java:54)
      at java.base/jdk.internal.reflect.NativeMethodAccessorImpl.invoke0(Native Method)
      at java.base/jdk.internal.reflect.NativeMethodAccessorImpl.invoke(NativeMethodAccessorImpl.java:62)
      at java.base/jdk.internal.reflect.DelegatingMethodAccessorImpl.invoke(DelegatingMethodAccessorImpl.java:43)
      at java.base/java.lang.reflect.Method.invoke(Method.java:564)
      at com.sun.javatest.regtest.agent.MainWrapper$MainThread.run(MainWrapper.java:115)
      at java.base/java.lang.Thread.run(Thread.java:844)

      JavaTest Message: Test threw exception: java.lang.Exception: failures: 1
      JavaTest Message: shutting down test

        Attachments

        1. dumpAll.xml
          49 kB
          Abdul Kolarkunnu
        2. failure.png
          1.04 MB
          Abdul Kolarkunnu
        3. window0.png
          36 kB
          Abdul Kolarkunnu

          Activity

            People

            Assignee:
            shurailine Aleksandre Iline
            Reporter:
            akolarkunnu Abdul Kolarkunnu
            Votes:
            0 Vote for this issue
            Watchers:
            5 Start watching this issue

              Dates

              Created:
              Updated:
              Resolved: