Uploaded image for project: 'JDK'
  1. JDK
  2. JDK-8192876

MacOS build fails intermittently after JDK-8139653

    Details

    • Subcomponent:
    • Resolved In Build:
      b35
    • OS:
      os_x

      Backports

        Description

        Build failed with the following error message:
         > Creating support/native/jdk.deploy.controlpanel/JavaUpdater/JavaUpdater from 9 file(s)
        jib > Creating support/modules_cmds/jdk.javaws/javaws from 19 file(s)
        jib > Creating support/modules_libs/jdk.javaws/shortcuts/JavaWSApplicationStub from 2 file(s)
        jib > warning: no debug symbols in executable (-arch x86_64)
        jib > warning: no debug symbols in executable (-arch x86_64)
        jib > ld: file too small (length=0) file '/scratch/...../....fe9a/workspace/.../.../modules_libs/java.desktop/libfontmanager.dylib' for architecture x86_64
        jib > clang: error: linker command failed with exit code 1 (use -v to see invocation)
        jib > /scratch/..../..../make/lib/Awt2dLibraries.gmk:30: recipe for target '/scratch/mesos/slaves/5af44a71-976a-41b7-81de-5773b84ec572-S38937/..../..../java.desktop/libt2k.dylib' failed
        jib > make[3]: *** [/scratch/..../..../java.desktop/libt2k.dylib] Error 1
        jib > make[3]: *** Waiting for unfinished jobs....
        jib > make/Main.gmk:226: recipe for target 'java.desktop-libs' failed
        jib > make[2]: *** [java.desktop-libs] Error 2
        jib >
        jib > ERROR: Build failed for target 'default (product-bundles test-bundles)' in configuration 'macosx-x64' (exit code 2)

          Issue Links

            Activity

            fyuan Frank Yuan created issue -
            erikj Erik Joelsson made changes -
            Field Original Value New Value
            Fix Version/s 10 [ 16302 ]
            erikj Erik Joelsson made changes -
            Status New [ 10000 ] Open [ 1 ]
            erikj Erik Joelsson made changes -
            Status Open [ 1 ] In Progress [ 3 ]
            Understanding Cause Known [ 10000 ]
            erikj Erik Joelsson made changes -
            Summary MacOS build failed after JDK-8139653 MacOS build fails intermittently after JDK-8139653
            erikj Erik Joelsson made changes -
            Labels build-infra CPU18_01-critical-watch build-infra
            asaha Abhijit Saha made changes -
            Link This issue relates to JDK-8139653 [ JDK-8139653 ]
            asaha Abhijit Saha made changes -
            Affects Version/s 9.0.4 [ 19229 ]
            hgupdate HG Updates made changes -
            Status In Progress [ 3 ] Resolved [ 5 ]
            Resolved In Build master [ 18256 ]
            Understanding Cause Known [ 10000 ]
            Resolution Fixed [ 1 ]
            hgupdate HG Updates made changes -
            Link This issue backported by JDK-8192918 [ JDK-8192918 ]
            asaha Abhijit Saha made changes -
            Labels CPU18_01-critical-watch build-infra CPU18_01-critical-request build-infra
            asaha Abhijit Saha made changes -
            Security Confidential [ 10000 ]
            asaha Abhijit Saha made changes -
            Security Confidential [ 10000 ]
            pmohan Praveen Mohan made changes -
            Labels CPU18_01-critical-request build-infra CPU18_01-critical-SQE-OK CPU18_01-critical-request build-infra
            kkrishnamurt Kavita Krishnamurthy made changes -
            Labels CPU18_01-critical-SQE-OK CPU18_01-critical-request build-infra CPU18_01-critical-SQE-OK CPU18_01-critical-approved build-infra
            hgupdate HG Updates made changes -
            Link This issue backported by JDK-8193002 [ JDK-8193002 ]
            hgupdate HG Updates made changes -
            Resolved In Build master [ 18256 ] b35 [ 17440 ]

              People

              • Assignee:
                erikj Erik Joelsson
                Reporter:
                fyuan Frank Yuan
              • Votes:
                0 Vote for this issue
                Watchers:
                5 Start watching this issue

                Dates

                • Created:
                  Updated:
                  Resolved: