Details

    • Type: Bug
    • Status: Resolved
    • Priority: P4
    • Resolution: Fixed
    • Affects Version/s: None
    • Fix Version/s: 11
    • Component/s: hotspot
    • Labels:
      None
    • Subcomponent:
    • Introduced In Version:
      10
    • Resolved In Build:
      b03
    • CPU:
      x86
    • OS:
      os_x

      Description

      > make CONF=macosx-x86_64-normal-server-release images
      Building configuration 'macosx-x86_64-normal-server-release' (matching CONF=macosx-x86_64-normal-server-release)
      Building target 'images' in configuration '/Users/dsimon/jdk-hs/build/macosx-x86_64-normal-server-release'
      clang: warning: libstdc++ is deprecated; move to libc++ [-Wdeprecated]
      clang: warning: libstdc++ is deprecated; move to libc++ [-Wdeprecated]
      Undefined symbols for architecture x86_64:
        "CHeapObj<(MemoryType)7>::operator delete(void*)", referenced from:
      Undefined symbols for architecture x86_64:
        "CHeapObj<(MemoryType)7>::operator delete(void*)", referenced from:
            MachODecoder::~MachODecoder() in decoder_machO.o
            MachODecoder::~MachODecoder() in decoder_machO.o
      ld: symbol(s) not found for architecture x86_64
      ld: symbol(s) not found for architecture x86_64
      clang: error: linker command failed with exit code 1 (use -v to see invocation)
      clang: error: linker command failed with exit code 1 (use -v to see invocation)
      gmake[3]: *** [lib/CompileJvm.gmk:214: /Users/dsimon/jdk-hs/build/macosx-x86_64-normal-server-release/support/modules_libs/java.base/server/libjvm.dylib] Error 1
      gmake[3]: *** Waiting for unfinished jobs....
      gmake[3]: *** [lib/CompileGtest.gmk:67: /Users/dsimon/jdk-hs/build/macosx-x86_64-normal-server-release/hotspot/variant-server/libjvm/gtest/libjvm.dylib] Error 1
      gmake[2]: *** [make/Main.gmk:268: hotspot-server-libs] Error 2
      gmake[2]: *** Waiting for unfinished jobs....


      > xcodebuild -version
      Xcode 9.1
      Build version 9B55

      > clang++ --version
      Apple LLVM version 9.0.0 (clang-900.0.38)
      Target: x86_64-apple-darwin17.2.0
      Thread model: posix
      InstalledDir: /Applications/Xcode.app/Contents/Developer/Toolchains/XcodeDefault.xctoolchain/usr/bin

        Attachments

          Issue Links

            Activity

              People

              • Assignee:
                gziemski Gerard Ziemski
                Reporter:
                dnsimon Douglas Simon
              • Votes:
                0 Vote for this issue
                Watchers:
                6 Start watching this issue

                Dates

                • Created:
                  Updated:
                  Resolved: