Uploaded image for project: 'JDK'
  1. JDK
  2. JDK-8194963

SystemDictionary::link_method_handle_constant() can't link MethodHandle.invoke()/invokeExact()

    Details

    • Type: Bug
    • Status: Closed
    • Priority: P2
    • Resolution: Fixed
    • Affects Version/s: 10
    • Fix Version/s: 10
    • Component/s: hotspot
    • Labels:
    • Subcomponent:
    • Resolved In Build:
      b40
    • Verification:
      Verified

      Backports

        Description

        [1] java/lang/invoke/MethodHandleConstants.java
        ----------System.err:(31/2045)----------
        patching test/java/lang/invoke/MethodHandleConstants.main(L)V
        46:invokestatic 10 MH_String_replace_C2()L => ldc 296:MethodHandle[5, 295]
        79:invokestatic 16 MH_MethodHandle_invokeExact_SC2()L => ldc 299:MethodHandle[5, 298]
        117:invokestatic 19 MH_MethodHandle_invoke_SC2()L => ldc 302:MethodHandle[5, 301]
        155:invokestatic 21 MH_Class_forName_S()L => ldc 305:MethodHandle[6, 304]
        176:invokestatic 23 MH_Class_forName_SbCL()L => ldc 308:MethodHandle[6, 307]
        java.lang.RuntimeException: java.lang.reflect.InvocationTargetException
        at indify.Indify.run(Indify.java:130)
        at indify.Indify.main(Indify.java:106)
        at java.base/jdk.internal.reflect.NativeMethodAccessorImpl.invoke0(Native Method)
        at java.base/jdk.internal.reflect.NativeMethodAccessorImpl.invoke(NativeMethodAccessorImpl.java:62)
        at java.base/jdk.internal.reflect.DelegatingMethodAccessorImpl.invoke(DelegatingMethodAccessorImpl.java:43)
        at java.base/java.lang.reflect.Method.invoke(Method.java:564)
        at com.sun.javatest.regtest.agent.MainWrapper$MainThread.run(MainWrapper.java:115)
        at java.base/java.lang.Thread.run(Thread.java:844)
        Caused by: java.lang.reflect.InvocationTargetException
        at java.base/jdk.internal.reflect.NativeMethodAccessorImpl.invoke0(Native Method)
        at java.base/jdk.internal.reflect.NativeMethodAccessorImpl.invoke(NativeMethodAccessorImpl.java:62)
        at java.base/jdk.internal.reflect.DelegatingMethodAccessorImpl.invoke(DelegatingMethodAccessorImpl.java:43)
        at java.base/java.lang.reflect.Method.invoke(Method.java:564)
        at indify.Indify.runApplication(Indify.java:158)
        at indify.Indify.run(Indify.java:127)
        ... 7 more
        Caused by: java.lang.InternalError: appendix
        at test.java.lang.invoke.MethodHandleConstants.main(MethodHandleConstants.java:56)
        ... 13 more


             --------


        [2] tools/javac/lambda/methodReferenceExecution/MethodReferenceTestMethodHandle.java
        ----------System.out:(99/6612)----------
        [TestNG] Running:
          tools/javac/lambda/methodReferenceExecution/MethodReferenceTestMethodHandle.java

        test MethodReferenceTestMethodHandle.testStatic(): failure
        java.lang.InternalError: appendix
        at MethodReferenceTestMethodHandle.testStatic(MethodReferenceTestMethodHandle.java:80)
        at java.base/jdk.internal.reflect.NativeMethodAccessorImpl.invoke0(Native Method)
        at java.base/jdk.internal.reflect.NativeMethodAccessorImpl.invoke(NativeMethodAccessorImpl.java:62)
        at java.base/jdk.internal.reflect.DelegatingMethodAccessorImpl.invoke(DelegatingMethodAccessorImpl.java:43)
        at java.base/java.lang.reflect.Method.invoke(Method.java:564)
        at org.testng.internal.MethodInvocationHelper.invokeMethod(MethodInvocationHelper.java:85)
        at org.testng.internal.Invoker.invokeMethod(Invoker.java:639)
        at org.testng.internal.Invoker.invokeTestMethod(Invoker.java:821)
        at org.testng.internal.Invoker.invokeTestMethods(Invoker.java:1131)
        at org.testng.internal.TestMethodWorker.invokeTestMethods(TestMethodWorker.java:124)
        at org.testng.internal.TestMethodWorker.run(TestMethodWorker.java:108)
        at org.testng.TestRunner.privateRun(TestRunner.java:773)
        at org.testng.TestRunner.run(TestRunner.java:623)
        at org.testng.SuiteRunner.runTest(SuiteRunner.java:357)
        at org.testng.SuiteRunner.runSequentially(SuiteRunner.java:352)
        at org.testng.SuiteRunner.privateRun(SuiteRunner.java:310)
        at org.testng.SuiteRunner.run(SuiteRunner.java:259)
        at org.testng.SuiteRunnerWorker.runSuite(SuiteRunnerWorker.java:52)
        at org.testng.SuiteRunnerWorker.run(SuiteRunnerWorker.java:86)
        at org.testng.TestNG.runSuitesSequentially(TestNG.java:1185)
        at org.testng.TestNG.runSuitesLocally(TestNG.java:1110)
        at org.testng.TestNG.run(TestNG.java:1018)
        at com.sun.javatest.regtest.agent.TestNGRunner.main(TestNGRunner.java:94)
        at jdk.internal.reflect.GeneratedMethodAccessor20.invoke(Unknown Source)
        at java.base/jdk.internal.reflect.DelegatingMethodAccessorImpl.invoke(DelegatingMethodAccessorImpl.java:43)
        at java.base/java.lang.reflect.Method.invoke(Method.java:564)
        at com.sun.javatest.regtest.agent.MainActionHelper$SameVMRunnable.run(MainActionHelper.java:230)
        at java.base/java.lang.Thread.run(Thread.java:844)
        test MethodReferenceTestMethodHandle.testVirtual(): failure
        java.lang.InternalError: appendix
        at MethodReferenceTestMethodHandle.testVirtual(MethodReferenceTestMethodHandle.java:66)
        at java.base/jdk.internal.reflect.NativeMethodAccessorImpl.invoke0(Native Method)
        at java.base/jdk.internal.reflect.NativeMethodAccessorImpl.invoke(NativeMethodAccessorImpl.java:62)
        at java.base/jdk.internal.reflect.DelegatingMethodAccessorImpl.invoke(DelegatingMethodAccessorImpl.java:43)
        at java.base/java.lang.reflect.Method.invoke(Method.java:564)
        at org.testng.internal.MethodInvocationHelper.invokeMethod(MethodInvocationHelper.java:85)
        at org.testng.internal.Invoker.invokeMethod(Invoker.java:639)
        at org.testng.internal.Invoker.invokeTestMethod(Invoker.java:821)
        at org.testng.internal.Invoker.invokeTestMethods(Invoker.java:1131)
        at org.testng.internal.TestMethodWorker.invokeTestMethods(TestMethodWorker.java:124)
        at org.testng.internal.TestMethodWorker.run(TestMethodWorker.java:108)
        at org.testng.TestRunner.privateRun(TestRunner.java:773)
        at org.testng.TestRunner.run(TestRunner.java:623)
        at org.testng.SuiteRunner.runTest(SuiteRunner.java:357)
        at org.testng.SuiteRunner.runSequentially(SuiteRunner.java:352)
        at org.testng.SuiteRunner.privateRun(SuiteRunner.java:310)
        at org.testng.SuiteRunner.run(SuiteRunner.java:259)
        at org.testng.SuiteRunnerWorker.runSuite(SuiteRunnerWorker.java:52)
        at org.testng.SuiteRunnerWorker.run(SuiteRunnerWorker.java:86)
        at org.testng.TestNG.runSuitesSequentially(TestNG.java:1185)
        at org.testng.TestNG.runSuitesLocally(TestNG.java:1110)
        at org.testng.TestNG.run(TestNG.java:1018)
        at com.sun.javatest.regtest.agent.TestNGRunner.main(TestNGRunner.java:94)
        at jdk.internal.reflect.GeneratedMethodAccessor20.invoke(Unknown Source)
        at java.base/jdk.internal.reflect.DelegatingMethodAccessorImpl.invoke(DelegatingMethodAccessorImpl.java:43)
        at java.base/java.lang.reflect.Method.invoke(Method.java:564)
        at com.sun.javatest.regtest.agent.MainActionHelper$SameVMRunnable.run(MainActionHelper.java:230)
        at java.base/java.lang.Thread.run(Thread.java:844)
        test MethodReferenceTestMethodHandle.testVoid(): failure
        java.lang.InternalError: appendix
        at MethodReferenceTestMethodHandle.testVoid(MethodReferenceTestMethodHandle.java:95)
        at java.base/jdk.internal.reflect.NativeMethodAccessorImpl.invoke0(Native Method)
        at java.base/jdk.internal.reflect.NativeMethodAccessorImpl.invoke(NativeMethodAccessorImpl.java:62)
        at java.base/jdk.internal.reflect.DelegatingMethodAccessorImpl.invoke(DelegatingMethodAccessorImpl.java:43)
        at java.base/java.lang.reflect.Method.invoke(Method.java:564)
        at org.testng.internal.MethodInvocationHelper.invokeMethod(MethodInvocationHelper.java:85)
        at org.testng.internal.Invoker.invokeMethod(Invoker.java:639)
        at org.testng.internal.Invoker.invokeTestMethod(Invoker.java:821)
        at org.testng.internal.Invoker.invokeTestMethods(Invoker.java:1131)
        at org.testng.internal.TestMethodWorker.invokeTestMethods(TestMethodWorker.java:124)
        at org.testng.internal.TestMethodWorker.run(TestMethodWorker.java:108)
        at org.testng.TestRunner.privateRun(TestRunner.java:773)
        at org.testng.TestRunner.run(TestRunner.java:623)
        at org.testng.SuiteRunner.runTest(SuiteRunner.java:357)
        at org.testng.SuiteRunner.runSequentially(SuiteRunner.java:352)
        at org.testng.SuiteRunner.privateRun(SuiteRunner.java:310)
        at org.testng.SuiteRunner.run(SuiteRunner.java:259)
        at org.testng.SuiteRunnerWorker.runSuite(SuiteRunnerWorker.java:52)
        at org.testng.SuiteRunnerWorker.run(SuiteRunnerWorker.java:86)
        at org.testng.TestNG.runSuitesSequentially(TestNG.java:1185)
        at org.testng.TestNG.runSuitesLocally(TestNG.java:1110)
        at org.testng.TestNG.run(TestNG.java:1018)
        at com.sun.javatest.regtest.agent.TestNGRunner.main(TestNGRunner.java:94)
        at jdk.internal.reflect.GeneratedMethodAccessor20.invoke(Unknown Source)
        at java.base/jdk.internal.reflect.DelegatingMethodAccessorImpl.invoke(DelegatingMethodAccessorImpl.java:43)
        at java.base/java.lang.reflect.Method.invoke(Method.java:564)
        at com.sun.javatest.regtest.agent.MainActionHelper$SameVMRunnable.run(MainActionHelper.java:230)
        at java.base/java.lang.Thread.run(Thread.java:844)

        ===============================================
        tools/javac/lambda/methodReferenceExecution/MethodReferenceTestMethodHandle.java
        Total tests run: 3, Failures: 3, Skips: 0
        ===============================================

        ----------System.err:(11/603)----------
        java.lang.Exception: failures: 3
        at com.sun.javatest.regtest.agent.TestNGRunner.main(TestNGRunner.java:96)
        at jdk.internal.reflect.GeneratedMethodAccessor20.invoke(Unknown Source)
        at java.base/jdk.internal.reflect.DelegatingMethodAccessorImpl.invoke(DelegatingMethodAccessorImpl.java:43)
        at java.base/java.lang.reflect.Method.invoke(Method.java:564)
        at com.sun.javatest.regtest.agent.MainActionHelper$SameVMRunnable.run(MainActionHelper.java:230)
        at java.base/java.lang.Thread.run(Thread.java:844)

        JavaTest Message: Test threw exception: java.lang.Exception
        JavaTest Message: shutting down test

        result: Failed. Execution failed: `main' threw exception: java.lang.Exception: failures: 3


        test result: Failed. Execution failed: `main' threw exception: java.lang.Exception: failures: 3

          Attachments

            Issue Links

              Activity

                People

                • Assignee:
                  vlivanov Vladimir Ivanov
                  Reporter:
                  iklam Ioi Lam
                • Votes:
                  0 Vote for this issue
                  Watchers:
                  6 Start watching this issue

                  Dates

                  • Created:
                    Updated:
                    Resolved: