Uploaded image for project: 'JDK'
  1. JDK
  2. JDK-8196087

java/awt/image/DrawImage/IncorrectUnmanagedImageRotatedClip.java fails

    XMLWordPrintable

    Details

    • Type: Bug
    • Status: Resolved
    • Priority: P4
    • Resolution: Fixed
    • Affects Version/s: 9, 10
    • Fix Version/s: 16
    • Component/s: client-libs
    • Labels:
    • Subcomponent:
      2d
    • Resolved In Build:
      b23

      Description

      Windows 7 at 125% scale ..
      ----------System.out:(0/0)----------
      ----------System.err:(14/922)----------
      java.lang.RuntimeException: Test failed.
      at IncorrectUnmanagedImageRotatedClip.test(IncorrectUnmanagedImageRotatedClip.java:95)
      at IncorrectUnmanagedImageRotatedClip.main(IncorrectUnmanagedImageRotatedClip.java:58)
      at java.base/jdk.internal.reflect.NativeMethodAccessorImpl.invoke0(Native Method)
      at java.base/jdk.internal.reflect.NativeMethodAccessorImpl.invoke(NativeMethodAccessorImpl.java:62)
      at java.base/jdk.internal.reflect.DelegatingMethodAccessorImpl.invoke(DelegatingMethodAccessorImpl.java:43)
      at java.base/java.lang.reflect.Method.invoke(Method.java:564)
      at com.sun.javatest.regtest.agent.MainWrapper$MainThread.run(MainWrapper.java:115)
      at java.base/java.lang.Thread.run(Thread.java:844)

      JavaTest Message: Test threw exception: java.lang.RuntimeException: Test failed.
      JavaTest Message: shutting down test

      STATUS:Failed.`main' threw exception: java.lang.RuntimeException: Test failed.

        Attachments

          Issue Links

            Activity

              People

              Assignee:
              serb Sergey Bylokhov
              Reporter:
              prr Philip Race
              Votes:
              0 Vote for this issue
              Watchers:
              4 Start watching this issue

                Dates

                Created:
                Updated:
                Resolved: