Uploaded image for project: 'JDK'
  1. JDK
  2. JDK-8197591

Tests failing with App waiting timeout

    Details

    • Subcomponent:
    • CPU:
      generic
    • OS:
      generic

      Description

      Test failed:


      ----------System.err:(22/1938)----------
      Command line: ['/scratch/opt/mach5/mesos/work_dir/jib-master/install/jdk12-jdk.39/solaris-sparcv9-debug.jdk/jdk-12/fastdebug/bin/java' '-Xcomp' '-cp' '/scratch/opt/mach5/mesos/work_dir/0a9b156e-0af8-49a6-a644-304b366c3832/testoutput/jtreg/JTwork/classes/3/serviceability/sa/ClhsdbFindPC.d:/scratch/opt/mach5/mesos/work_dir/0a9b156e-0af8-49a6-a644-304b366c3832/testoutput/jtreg/JTwork/classes/3/test/lib' 'jdk.test.lib.apps.LingeredApp' '0a3944fa-904d-4d1e-ab02-e00ba43c2691.lck' ]
      LingeredApp failed to start: java.io.IOException: App waiting timeout
      java.lang.RuntimeException: Test ERROR java.lang.RuntimeException: Process is still alive. Can't get its output.
      at ClhsdbFindPC.testFindPC(ClhsdbFindPC.java:95)
      at ClhsdbFindPC.main(ClhsdbFindPC.java:103)
      at java.base/jdk.internal.reflect.NativeMethodAccessorImpl.invoke0(Native Method)
      at java.base/jdk.internal.reflect.NativeMethodAccessorImpl.invoke(NativeMethodAccessorImpl.java:62)
      at java.base/jdk.internal.reflect.DelegatingMethodAccessorImpl.invoke(DelegatingMethodAccessorImpl.java:43)
      at java.base/java.lang.reflect.Method.invoke(Method.java:566)
      at com.sun.javatest.regtest.agent.MainWrapper$MainThread.run(MainWrapper.java:115)
      at java.base/java.lang.Thread.run(Thread.java:834)
      Caused by: java.lang.RuntimeException: Process is still alive. Can't get its output.
      at jdk.test.lib.apps.LingeredApp.getOutput(LingeredApp.java:146)
      at jdk.test.lib.apps.LingeredApp.finishApp(LingeredApp.java:359)
      at jdk.test.lib.apps.LingeredApp.startApp(LingeredApp.java:406)
      at ClhsdbFindPC.testFindPC(ClhsdbFindPC.java:46)
      ... 7 more

      JavaTest Message: Test threw exception: java.lang.RuntimeException: Test ERROR java.lang.RuntimeException: Process is still alive. Can't get its output.

        Attachments

          Issue Links

            Activity

              People

              • Assignee:
                Unassigned
                Reporter:
                aharlap Alexander Harlap (Inactive)
              • Votes:
                0 Vote for this issue
                Watchers:
                15 Start watching this issue

                Dates

                • Created:
                  Updated: