Uploaded image for project: 'JDK'
  1. JDK
  2. JDK-8199225

Execution failed for task ':app:compileDebugJavaWithJavac'.

    Details

    • Type: Bug
    • Status: Closed
    • Priority: P4
    • Resolution: Duplicate
    • Affects Version/s: 7
    • Fix Version/s: None
    • Component/s: tools
    • Subcomponent:
    • CPU:
      x86
    • OS:
      windows_8

      Description

      FULL PRODUCT VERSION :
      java version "1.7.0"
      Java(TM) SE Runtime Environment (build 1.7.0-b147)
      Java HotSpot(TM) Client VM (build 21.0-b17, mixed mode)

      ADDITIONAL OS VERSION INFORMATION :
      Win 8 Pro6.2.9200 build 9200

      EXTRA RELEVANT SYSTEM CONFIGURATION :
      executed from android studio 2.0.0 while deploying the apk to mobile device

      A DESCRIPTION OF THE PROBLEM :
      The error was reported in Android Studio and it has not created any log file. Can not really give separate report file for each one.

      REGRESSION. Last worked in version 7u79

      STEPS TO FOLLOW TO REPRODUCE THE PROBLEM :
      first synchronized with gradle build - reported "Build Success"
      but while deploying the project to mobile device reported "NullPointerException"



      EXPECTED VERSUS ACTUAL BEHAVIOR :
      EXPECTED -
      build successfully and installing apk ... should be reported
      ACTUAL -
      Executing tasks: [:app:generateDebugSources, :app:prepareDebugUnitTestDependencies, :app:mockableAndroidJar, :app:generateDebugAndroidTestSources]

      Configuration on demand is an incubating feature.
      Incremental java compilation is an incubating feature.
      :app:preBuild UP-TO-DATE
      :app:preDebugBuild UP-TO-DATE
      :app:checkDebugManifest
      :app:preReleaseBuild UP-TO-DATE
      :app:prepareComAndroidSupportAnimatedVectorDrawable2340Library
      :app:prepareComAndroidSupportAppcompatV72340Library
      :app:prepareComAndroidSupportRecyclerviewV72340Library
      :app:prepareComAndroidSupportSupportV42340Library
      :app:prepareComAndroidSupportSupportVectorDrawable2340Library
      :app:prepareDebugDependencies
      :app:compileDebugAidl
      :app:compileDebugRenderscript
      :app:generateDebugBuildConfig
      :app:generateDebugAssets UP-TO-DATE
      :app:mergeDebugAssets
      :app:generateDebugResValues
      :app:generateDebugResources
      :app:mergeDebugResources
      :app:processDebugManifest
      :app:processDebugResources
      :app:generateDebugSources
      :app:preDebugUnitTestBuild UP-TO-DATE
      :app:prepareDebugUnitTestDependencies
      :app:mockableAndroidJar
      :app:preDebugAndroidTestBuild UP-TO-DATE
      :app:prepareDebugAndroidTestDependencies
      :app:compileDebugAndroidTestAidl
      :app:processDebugAndroidTestManifest
      :app:compileDebugAndroidTestRenderscript
      :app:generateDebugAndroidTestBuildConfig
      :app:generateDebugAndroidTestAssets UP-TO-DATE
      :app:mergeDebugAndroidTestAssets
      :app:generateDebugAndroidTestResValues
      :app:generateDebugAndroidTestResources
      :app:mergeDebugAndroidTestResources
      :app:processDebugAndroidTestResources
      :app:generateDebugAndroidTestSources

      BUILD SUCCESSFUL

      Total time: 21.15 secs
      Executing tasks: [:app:clean, :app:generateDebugSources, :app:prepareDebugUnitTestDependencies, :app:mockableAndroidJar, :app:generateDebugAndroidTestSources, :app:assembleDebug]

      Configuration on demand is an incubating feature.
      Incremental java compilation is an incubating feature.
      :app:clean
      :app:preBuild UP-TO-DATE
      :app:preDebugBuild UP-TO-DATE
      :app:checkDebugManifest
      :app:preReleaseBuild UP-TO-DATE
      :app:prepareComAndroidSupportAnimatedVectorDrawable2340Library
      :app:prepareComAndroidSupportAppcompatV72340Library
      :app:prepareComAndroidSupportRecyclerviewV72340Library
      :app:prepareComAndroidSupportSupportV42340Library
      :app:prepareComAndroidSupportSupportVectorDrawable2340Library
      :app:prepareDebugDependencies
      :app:compileDebugAidl
      :app:compileDebugRenderscript
      :app:generateDebugBuildConfig
      :app:generateDebugAssets UP-TO-DATE
      :app:mergeDebugAssets
      :app:generateDebugResValues UP-TO-DATE
      :app:generateDebugResources
      :app:mergeDebugResources
      :app:processDebugManifest
      :app:processDebugResources
      :app:generateDebugSources
      :app:preDebugUnitTestBuild UP-TO-DATE
      :app:prepareDebugUnitTestDependencies
      :app:mockableAndroidJar
      :app:preDebugAndroidTestBuild UP-TO-DATE
      :app:prepareDebugAndroidTestDependencies
      :app:compileDebugAndroidTestAidl
      :app:processDebugAndroidTestManifest
      :app:compileDebugAndroidTestRenderscript
      :app:generateDebugAndroidTestBuildConfig
      :app:generateDebugAndroidTestAssets UP-TO-DATE
      :app:mergeDebugAndroidTestAssets
      :app:generateDebugAndroidTestResValues UP-TO-DATE
      :app:generateDebugAndroidTestResources
      :app:mergeDebugAndroidTestResources
      :app:processDebugAndroidTestResources
      :app:generateDebugAndroidTestSources
      :app:compileDebugJavaWithJavac
      An exception has occurred in the compiler (1.7.0). Please file a bug at the Java Developer Connection (http://java.sun.com/webapps/bugreport) after checking the Bug Parade for duplicates. Include your program and the following diagnostic in your report. Thank you.
      java.lang.NullPointerException
      at com.sun.tools.javac.comp.Lower.visitStringSwitch(Lower.java:3456)
      at com.sun.tools.javac.comp.Lower.visitSwitch(Lower.java:3357)
      at com.sun.tools.javac.tree.JCTree$JCSwitch.accept(JCTree.java:959)
      at com.sun.tools.javac.tree.TreeTranslator.translate(TreeTranslator.java:58)
      at com.sun.tools.javac.comp.Lower.translate(Lower.java:2160)
      at com.sun.tools.javac.tree.TreeTranslator.translate(TreeTranslator.java:70)
      at com.sun.tools.javac.tree.TreeTranslator.visitBlock(TreeTranslator.java:160)
      at com.sun.tools.javac.comp.Lower.visitBlock(Lower.java:3311)
      at com.sun.tools.javac.tree.JCTree$JCBlock.accept(JCTree.java:781)
      at com.sun.tools.javac.tree.TreeTranslator.translate(TreeTranslator.java:58)
      at com.sun.tools.javac.comp.Lower.translate(Lower.java:2160)
      at com.sun.tools.javac.tree.TreeTranslator.visitMethodDef(TreeTranslator.java:144)
      at com.sun.tools.javac.comp.Lower.visitMethodDefInternal(Lower.java:2619)
      at com.sun.tools.javac.comp.Lower.visitMethodDef(Lower.java:2538)
      at com.sun.tools.javac.tree.JCTree$JCMethodDecl.accept(JCTree.java:669)
      at com.sun.tools.javac.tree.TreeTranslator.translate(TreeTranslator.java:58)
      at com.sun.tools.javac.comp.Lower.translate(Lower.java:2160)
      at com.sun.tools.javac.comp.Lower.visitClassDef(Lower.java:2283)
      at com.sun.tools.javac.tree.JCTree$JCClassDecl.accept(JCTree.java:591)
      at com.sun.tools.javac.tree.TreeTranslator.translate(TreeTranslator.java:58)
      at com.sun.tools.javac.comp.Lower.translate(Lower.java:2160)
      at com.sun.tools.javac.comp.Lower.translate(Lower.java:2180)
      at com.sun.tools.javac.comp.Lower.translateTopLevelClass(Lower.java:3650)
      at com.sun.tools.javac.main.JavaCompiler.desugar(JavaCompiler.java:1393)
      at com.sun.tools.javac.main.JavaCompiler.desugar(JavaCompiler.java:1271)
      at com.sun.tools.javac.main.JavaCompiler.compile2(JavaCompiler.java:870)
      at com.sun.tools.javac.main.JavaCompiler.compile(JavaCompiler.java:829)
      at com.sun.tools.javac.main.Main.compile(Main.java:417)
      at com.sun.tools.javac.api.JavacTaskImpl.call(JavacTaskImpl.java:132)
      at org.gradle.api.internal.tasks.compile.JdkJavaCompiler.execute(JdkJavaCompiler.java:45)
      at org.gradle.api.internal.tasks.compile.JdkJavaCompiler.execute(JdkJavaCompiler.java:33)
      at org.gradle.api.internal.tasks.compile.NormalizingJavaCompiler.delegateAndHandleErrors(NormalizingJavaCompiler.java:101)
      at org.gradle.api.internal.tasks.compile.NormalizingJavaCompiler.execute(NormalizingJavaCompiler.java:50)
      at org.gradle.api.internal.tasks.compile.NormalizingJavaCompiler.execute(NormalizingJavaCompiler.java:36)
      at org.gradle.api.internal.tasks.compile.CleaningJavaCompilerSupport.execute(CleaningJavaCompilerSupport.java:34)
      at org.gradle.api.internal.tasks.compile.CleaningJavaCompilerSupport.execute(CleaningJavaCompilerSupport.java:25)
      at org.gradle.api.tasks.compile.JavaCompile.performCompilation(JavaCompile.java:157)
      at org.gradle.api.tasks.compile.JavaCompile.compile(JavaCompile.java:139)
      at org.gradle.api.tasks.compile.JavaCompile.compile(JavaCompile.java:93)
      at com.android.build.gradle.tasks.factory.AndroidJavaCompile.compile(AndroidJavaCompile.java:39)
      at sun.reflect.NativeMethodAccessorImpl.invoke0(Native Method)
      at sun.reflect.NativeMethodAccessorImpl.invoke(NativeMethodAccessorImpl.java:57)
      at sun.reflect.DelegatingMethodAccessorImpl.invoke(DelegatingMethodAccessorImpl.java:43)
      at java.lang.reflect.Method.invoke(Method.java:601)
      at org.gradle.internal.reflect.JavaMethod.invoke(JavaMethod.java:75)
      at org.gradle.api.internal.project.taskfactory.AnnotationProcessingTaskFactory$IncrementalTaskAction.doExecute(AnnotationProcessingTaskFactory.java:244)
      at org.gradle.api.internal.project.taskfactory.AnnotationProcessingTaskFactory$StandardTaskAction.execute(AnnotationProcessingTaskFactory.java:220)
      at org.gradle.api.internal.project.taskfactory.AnnotationProcessingTaskFactory$IncrementalTaskAction.execute(AnnotationProcessingTaskFactory.java:231)
      at org.gradle.api.internal.project.taskfactory.AnnotationProcessingTaskFactory$StandardTaskAction.execute(AnnotationProcessingTaskFactory.java:209)
      at org.gradle.api.internal.tasks.execution.ExecuteActionsTaskExecuter.executeAction(ExecuteActionsTaskExecuter.java:80)
      at org.gradle.api.internal.tasks.execution.ExecuteActionsTaskExecuter.executeActions(ExecuteActionsTaskExecuter.java:61)
      at org.gradle.api.internal.tasks.execution.ExecuteActionsTaskExecuter.execute(ExecuteActionsTaskExecuter.java:46)
      at org.gradle.api.internal.tasks.execution.PostExecutionAnalysisTaskExecuter.execute(PostExecutionAnalysisTaskExecuter.java:35)
      at org.gradle.api.internal.tasks.execution.SkipUpToDateTaskExecuter.execute(SkipUpToDateTaskExecuter.java:64)
      at org.gradle.api.internal.tasks.execution.ValidatingTaskExecuter.execute(ValidatingTaskExecuter.java:58)
      at org.gradle.api.internal.tasks.execution.SkipEmptySourceFilesTaskExecuter.execute(SkipEmptySourceFilesTaskExecuter.java:52)
      at org.gradle.api.internal.tasks.execution.SkipTaskWithNoActionsExecuter.execute(SkipTaskWithNoActionsExecuter.java:52)
      at org.gradle.api.internal.tasks.execution.SkipOnlyIfTaskExecuter.execute(SkipOnlyIfTaskExecuter.java:53)
      at org.gradle.api.internal.tasks.execution.ExecuteAtMostOnceTaskExecuter.execute(ExecuteAtMostOnceTaskExecuter.java:43)
      at org.gradle.execution.taskgraph.DefaultTaskGraphExecuter$EventFiringTaskWorker.execute(DefaultTaskGraphExecuter.java:203)
      at org.gradle.execution.taskgraph.DefaultTaskGraphExecuter$EventFiringTaskWorker.execute(DefaultTaskGraphExecuter.java:185)
      at org.gradle.execution.taskgraph.AbstractTaskPlanExecutor$TaskExecutorWorker.processTask(AbstractTaskPlanExecutor.java:66)
      at org.gradle.execution.taskgraph.AbstractTaskPlanExecutor$TaskExecutorWorker.run(AbstractTaskPlanExecutor.java:50)
      at org.gradle.execution.taskgraph.DefaultTaskPlanExecutor.process(DefaultTaskPlanExecutor.java:25)
      at org.gradle.execution.taskgraph.DefaultTaskGraphExecuter.execute(DefaultTaskGraphExecuter.java:110)
      at org.gradle.execution.SelectedTaskExecutionAction.execute(SelectedTaskExecutionAction.java:37)
      at org.gradle.execution.DefaultBuildExecuter.execute(DefaultBuildExecuter.java:37)
      at org.gradle.execution.DefaultBuildExecuter.access$000(DefaultBuildExecuter.java:23)
      at org.gradle.execution.DefaultBuildExecuter$1.proceed(DefaultBuildExecuter.java:43)
      at org.gradle.execution.DryRunBuildExecutionAction.execute(DryRunBuildExecutionAction.java:32)
      at org.gradle.execution.DefaultBuildExecuter.execute(DefaultBuildExecuter.java:37)
      at org.gradle.execution.DefaultBuildExecuter.execute(DefaultBuildExecuter.java:30)
      at org.gradle.initialization.DefaultGradleLauncher$4.run(DefaultGradleLauncher.java:154)
      at org.gradle.internal.Factories$1.create(Factories.java:22)
      at org.gradle.internal.progress.DefaultBuildOperationExecutor.run(DefaultBuildOperationExecutor.java:90)
      at org.gradle.internal.progress.DefaultBuildOperationExecutor.run(DefaultBuildOperationExecutor.java:52)
      at org.gradle.initialization.DefaultGradleLauncher.doBuildStages(DefaultGradleLauncher.java:151)
      at org.gradle.initialization.DefaultGradleLauncher.access$200(DefaultGradleLauncher.java:32)
      at org.gradle.initialization.DefaultGradleLauncher$1.create(DefaultGradleLauncher.java:99)
      at org.gradle.initialization.DefaultGradleLauncher$1.create(DefaultGradleLauncher.java:93)
      at org.gradle.internal.progress.DefaultBuildOperationExecutor.run(DefaultBuildOperationExecutor.java:90)
      at org.gradle.internal.progress.DefaultBuildOperationExecutor.run(DefaultBuildOperationExecutor.java:62)
      at org.gradle.initialization.DefaultGradleLauncher.doBuild(DefaultGradleLauncher.java:93)
      at org.gradle.initialization.DefaultGradleLauncher.run(DefaultGradleLauncher.java:82)
      at org.gradle.launcher.exec.InProcessBuildActionExecuter$DefaultBuildController.run(InProcessBuildActionExecuter.java:94)
      at org.gradle.tooling.internal.provider.runner.BuildModelActionRunner.run(BuildModelActionRunner.java:46)
      at org.gradle.launcher.exec.ChainingBuildActionRunner.run(ChainingBuildActionRunner.java:35)
      at org.gradle.tooling.internal.provider.runner.SubscribableBuildActionRunner.run(SubscribableBuildActionRunner.java:58)
      at org.gradle.launcher.exec.ChainingBuildActionRunner.run(ChainingBuildActionRunner.java:35)
      at org.gradle.launcher.exec.InProcessBuildActionExecuter.execute(InProcessBuildActionExecuter.java:43)
      at org.gradle.launcher.exec.InProcessBuildActionExecuter.execute(InProcessBuildActionExecuter.java:28)
      at org.gradle.launcher.exec.ContinuousBuildActionExecuter.execute(ContinuousBuildActionExecuter.java:78)
      at org.gradle.launcher.exec.ContinuousBuildActionExecuter.execute(ContinuousBuildActionExecuter.java:48)
      at org.gradle.launcher.daemon.server.exec.ExecuteBuild.doBuild(ExecuteBuild.java:52)
      at org.gradle.launcher.daemon.server.exec.BuildCommandOnly.execute(BuildCommandOnly.java:36)
      at org.gradle.launcher.daemon.server.api.DaemonCommandExecution.proceed(DaemonCommandExecution.java:120)
      at org.gradle.launcher.daemon.server.exec.WatchForDisconnection.execute(WatchForDisconnection.java:37)
      at org.gradle.launcher.daemon.server.api.DaemonCommandExecution.proceed(DaemonCommandExecution.java:120)
      at org.gradle.launcher.daemon.server.exec.ResetDeprecationLogger.execute(ResetDeprecationLogger.java:26)
      at org.gradle.launcher.daemon.server.api.DaemonCommandExecution.proceed(DaemonCommandExecution.java:120)
      at org.gradle.launcher.daemon.server.exec.RequestStopIfSingleUsedDaemon.execute(RequestStopIfSingleUsedDaemon.java:34)
      at org.gradle.launcher.daemon.server.api.DaemonCommandExecution.proceed(DaemonCommandExecution.java:120)
      at org.gradle.launcher.daemon.server.exec.ForwardClientInput$2.call(ForwardClientInput.java:74)
      at org.gradle.launcher.daemon.server.exec.ForwardClientInput$2.call(ForwardClientInput.java:72)
      at org.gradle.util.Swapper.swap(Swapper.java:38)
      at org.gradle.launcher.daemon.server.exec.ForwardClientInput.execute(ForwardClientInput.java:72)
      at org.gradle.launcher.daemon.server.api.DaemonCommandExecution.proceed(DaemonCommandExecution.java:120)
      at org.gradle.launcher.daemon.server.health.DaemonHealthTracker.execute(DaemonHealthTracker.java:47)
      at org.gradle.launcher.daemon.server.api.DaemonCommandExecution.proceed(DaemonCommandExecution.java:120)
      at org.gradle.launcher.daemon.server.exec.LogToClient.doBuild(LogToClient.java:66)
      at org.gradle.launcher.daemon.server.exec.BuildCommandOnly.execute(BuildCommandOnly.java:36)
      at org.gradle.launcher.daemon.server.api.DaemonCommandExecution.proceed(DaemonCommandExecution.java:120)
      at org.gradle.launcher.daemon.server.exec.EstablishBuildEnvironment.doBuild(EstablishBuildEnvironment.java:72)
      at org.gradle.launcher.daemon.server.exec.BuildCommandOnly.execute(BuildCommandOnly.java:36)
      at org.gradle.launcher.daemon.server.api.DaemonCommandExecution.proceed(DaemonCommandExecution.java:120)
      at org.gradle.launcher.daemon.server.health.HintGCAfterBuild.execute(HintGCAfterBuild.java:41)
      at org.gradle.launcher.daemon.server.api.DaemonCommandExecution.proceed(DaemonCommandExecution.java:120)
      at org.gradle.launcher.daemon.server.exec.StartBuildOrRespondWithBusy$1.run(StartBuildOrRespondWithBusy.java:50)
      at org.gradle.launcher.daemon.server.DaemonStateCoordinator$1.run(DaemonStateCoordinator.java:246)
      at org.gradle.internal.concurrent.ExecutorPolicy$CatchAndRecordFailures.onExecute(ExecutorPolicy.java:54)
      at org.gradle.internal.concurrent.StoppableExecutorImpl$1.run(StoppableExecutorImpl.java:40)
      at java.util.concurrent.ThreadPoolExecutor.runWorker(ThreadPoolExecutor.java:1110)
      at java.util.concurrent.ThreadPoolExecutor$Worker.run(ThreadPoolExecutor.java:603)
      at java.lang.Thread.run(Thread.java:722)

       FAILED

      FAILURE: Build failed with an exception.

      * What went wrong:
      Execution failed for task ':app:compileDebugJavaWithJavac'.
      > Compilation failed; see the compiler error output for details.

      * Try:
      Run with --stacktrace option to get the stack trace. Run with --info or --debug option to get more log output.

      ERROR MESSAGES/STACK TRACES THAT OCCUR :
      no log file was created in the android project folder/subfolder(s)

      REPRODUCIBILITY :
      This bug can be reproduced rarely.

      ---------- BEGIN SOURCE ----------
      Information:Gradle tasks [:app:clean, :app:generateDebugSources, :app:prepareDebugUnitTestDependencies, :app:mockableAndroidJar, :app:generateDebugAndroidTestSources, :app:assembleDebug]
      :app:clean
      :app:preBuild UP-TO-DATE
      :app:preDebugBuild UP-TO-DATE
      :app:checkDebugManifest
      :app:preReleaseBuild UP-TO-DATE
      :app:prepareComAndroidSupportAnimatedVectorDrawable2340Library
      :app:prepareComAndroidSupportAppcompatV72340Library
      :app:prepareComAndroidSupportRecyclerviewV72340Library
      :app:prepareComAndroidSupportSupportV42340Library
      :app:prepareComAndroidSupportSupportVectorDrawable2340Library
      :app:prepareDebugDependencies
      :app:compileDebugAidl
      :app:compileDebugRenderscript
      :app:generateDebugBuildConfig
      :app:generateDebugAssets UP-TO-DATE
      :app:mergeDebugAssets
      :app:generateDebugResValues UP-TO-DATE
      :app:generateDebugResources
      :app:mergeDebugResources
      :app:processDebugManifest
      :app:processDebugResources
      :app:generateDebugSources
      :app:preDebugUnitTestBuild UP-TO-DATE
      :app:prepareDebugUnitTestDependencies
      :app:mockableAndroidJar
      :app:preDebugAndroidTestBuild UP-TO-DATE
      :app:prepareDebugAndroidTestDependencies
      :app:compileDebugAndroidTestAidl
      :app:processDebugAndroidTestManifest
      :app:compileDebugAndroidTestRenderscript
      :app:generateDebugAndroidTestBuildConfig
      :app:generateDebugAndroidTestAssets UP-TO-DATE
      :app:mergeDebugAndroidTestAssets
      :app:generateDebugAndroidTestResValues UP-TO-DATE
      :app:generateDebugAndroidTestResources
      :app:mergeDebugAndroidTestResources
      :app:processDebugAndroidTestResources
      :app:generateDebugAndroidTestSources
      :app:compileDebugJavaWithJavac
      An exception has occurred in the compiler (1.7.0). Please file a bug at the Java Developer Connection (http://java.sun.com/webapps/bugreport) after checking the Bug Parade for duplicates. Include your program and the following diagnostic in your report. Thank you.
      java.lang.NullPointerException
      at com.sun.tools.javac.comp.Lower.visitStringSwitch(Lower.java:3456)
      at com.sun.tools.javac.comp.Lower.visitSwitch(Lower.java:3357)
      at com.sun.tools.javac.tree.JCTree$JCSwitch.accept(JCTree.java:959)
      at com.sun.tools.javac.tree.TreeTranslator.translate(TreeTranslator.java:58)
      at com.sun.tools.javac.comp.Lower.translate(Lower.java:2160)
      at com.sun.tools.javac.tree.TreeTranslator.translate(TreeTranslator.java:70)
      at com.sun.tools.javac.tree.TreeTranslator.visitBlock(TreeTranslator.java:160)
      at com.sun.tools.javac.comp.Lower.visitBlock(Lower.java:3311)
      at com.sun.tools.javac.tree.JCTree$JCBlock.accept(JCTree.java:781)
      at com.sun.tools.javac.tree.TreeTranslator.translate(TreeTranslator.java:58)
      at com.sun.tools.javac.comp.Lower.translate(Lower.java:2160)
      at com.sun.tools.javac.tree.TreeTranslator.visitMethodDef(TreeTranslator.java:144)
      at com.sun.tools.javac.comp.Lower.visitMethodDefInternal(Lower.java:2619)
      at com.sun.tools.javac.comp.Lower.visitMethodDef(Lower.java:2538)
      at com.sun.tools.javac.tree.JCTree$JCMethodDecl.accept(JCTree.java:669)
      at com.sun.tools.javac.tree.TreeTranslator.translate(TreeTranslator.java:58)
      at com.sun.tools.javac.comp.Lower.translate(Lower.java:2160)
      at com.sun.tools.javac.comp.Lower.visitClassDef(Lower.java:2283)
      at com.sun.tools.javac.tree.JCTree$JCClassDecl.accept(JCTree.java:591)
      at com.sun.tools.javac.tree.TreeTranslator.translate(TreeTranslator.java:58)
      at com.sun.tools.javac.comp.Lower.translate(Lower.java:2160)
      at com.sun.tools.javac.comp.Lower.translate(Lower.java:2180)
      at com.sun.tools.javac.comp.Lower.translateTopLevelClass(Lower.java:3650)
      at com.sun.tools.javac.main.JavaCompiler.desugar(JavaCompiler.java:1393)
      at com.sun.tools.javac.main.JavaCompiler.desugar(JavaCompiler.java:1271)
      at com.sun.tools.javac.main.JavaCompiler.compile2(JavaCompiler.java:870)
      at com.sun.tools.javac.main.JavaCompiler.compile(JavaCompiler.java:829)
      at com.sun.tools.javac.main.Main.compile(Main.java:417)
      at com.sun.tools.javac.api.JavacTaskImpl.call(JavacTaskImpl.java:132)
      at org.gradle.api.internal.tasks.compile.JdkJavaCompiler.execute(JdkJavaCompiler.java:45)
      at org.gradle.api.internal.tasks.compile.JdkJavaCompiler.execute(JdkJavaCompiler.java:33)
      at org.gradle.api.internal.tasks.compile.NormalizingJavaCompiler.delegateAndHandleErrors(NormalizingJavaCompiler.java:101)
      at org.gradle.api.internal.tasks.compile.NormalizingJavaCompiler.execute(NormalizingJavaCompiler.java:50)
      at org.gradle.api.internal.tasks.compile.NormalizingJavaCompiler.execute(NormalizingJavaCompiler.java:36)
      at org.gradle.api.internal.tasks.compile.CleaningJavaCompilerSupport.execute(CleaningJavaCompilerSupport.java:34)
      at org.gradle.api.internal.tasks.compile.CleaningJavaCompilerSupport.execute(CleaningJavaCompilerSupport.java:25)
      at org.gradle.api.tasks.compile.JavaCompile.performCompilation(JavaCompile.java:157)
      at org.gradle.api.tasks.compile.JavaCompile.compile(JavaCompile.java:139)
      at org.gradle.api.tasks.compile.JavaCompile.compile(JavaCompile.java:93)
      at com.android.build.gradle.tasks.factory.AndroidJavaCompile.compile(AndroidJavaCompile.java:39)
      at sun.reflect.NativeMethodAccessorImpl.invoke0(Native Method)
      at sun.reflect.NativeMethodAccessorImpl.invoke(NativeMethodAccessorImpl.java:57)
      at sun.reflect.DelegatingMethodAccessorImpl.invoke(DelegatingMethodAccessorImpl.java:43)
      at java.lang.reflect.Method.invoke(Method.java:601)
      at org.gradle.internal.reflect.JavaMethod.invoke(JavaMethod.java:75)
      at org.gradle.api.internal.project.taskfactory.AnnotationProcessingTaskFactory$IncrementalTaskAction.doExecute(AnnotationProcessingTaskFactory.java:244)
      at org.gradle.api.internal.project.taskfactory.AnnotationProcessingTaskFactory$StandardTaskAction.execute(AnnotationProcessingTaskFactory.java:220)
      at org.gradle.api.internal.project.taskfactory.AnnotationProcessingTaskFactory$IncrementalTaskAction.execute(AnnotationProcessingTaskFactory.java:231)
      at org.gradle.api.internal.project.taskfactory.AnnotationProcessingTaskFactory$StandardTaskAction.execute(AnnotationProcessingTaskFactory.java:209)
      at org.gradle.api.internal.tasks.execution.ExecuteActionsTaskExecuter.executeAction(ExecuteActionsTaskExecuter.java:80)
      at org.gradle.api.internal.tasks.execution.ExecuteActionsTaskExecuter.executeActions(ExecuteActionsTaskExecuter.java:61)
      at org.gradle.api.internal.tasks.execution.ExecuteActionsTaskExecuter.execute(ExecuteActionsTaskExecuter.java:46)
      at org.gradle.api.internal.tasks.execution.PostExecutionAnalysisTaskExecuter.execute(PostExecutionAnalysisTaskExecuter.java:35)
      at org.gradle.api.internal.tasks.execution.SkipUpToDateTaskExecuter.execute(SkipUpToDateTaskExecuter.java:64)
      at org.gradle.api.internal.tasks.execution.ValidatingTaskExecuter.execute(ValidatingTaskExecuter.java:58)
      at org.gradle.api.internal.tasks.execution.SkipEmptySourceFilesTaskExecuter.execute(SkipEmptySourceFilesTaskExecuter.java:52)
      at org.gradle.api.internal.tasks.execution.SkipTaskWithNoActionsExecuter.execute(SkipTaskWithNoActionsExecuter.java:52)
      at org.gradle.api.internal.tasks.execution.SkipOnlyIfTaskExecuter.execute(SkipOnlyIfTaskExecuter.java:53)
      at org.gradle.api.internal.tasks.execution.ExecuteAtMostOnceTaskExecuter.execute(ExecuteAtMostOnceTaskExecuter.java:43)
      at org.gradle.execution.taskgraph.DefaultTaskGraphExecuter$EventFiringTaskWorker.execute(DefaultTaskGraphExecuter.java:203)
      at org.gradle.execution.taskgraph.DefaultTaskGraphExecuter$EventFiringTaskWorker.execute(DefaultTaskGraphExecuter.java:185)
      at org.gradle.execution.taskgraph.AbstractTaskPlanExecutor$TaskExecutorWorker.processTask(AbstractTaskPlanExecutor.java:66)
      at org.gradle.execution.taskgraph.AbstractTaskPlanExecutor$TaskExecutorWorker.run(AbstractTaskPlanExecutor.java:50)
      at org.gradle.execution.taskgraph.DefaultTaskPlanExecutor.process(DefaultTaskPlanExecutor.java:25)
      at org.gradle.execution.taskgraph.DefaultTaskGraphExecuter.execute(DefaultTaskGraphExecuter.java:110)
      at org.gradle.execution.SelectedTaskExecutionAction.execute(SelectedTaskExecutionAction.java:37)
      at org.gradle.execution.DefaultBuildExecuter.execute(DefaultBuildExecuter.java:37)
      at org.gradle.execution.DefaultBuildExecuter.access$000(DefaultBuildExecuter.java:23)
      at org.gradle.execution.DefaultBuildExecuter$1.proceed(DefaultBuildExecuter.java:43)
      at org.gradle.execution.DryRunBuildExecutionAction.execute(DryRunBuildExecutionAction.java:32)
      at org.gradle.execution.DefaultBuildExecuter.execute(DefaultBuildExecuter.java:37)
      at org.gradle.execution.DefaultBuildExecuter.execute(DefaultBuildExecuter.java:30)
      at org.gradle.initialization.DefaultGradleLauncher$4.run(DefaultGradleLauncher.java:154)
      at org.gradle.internal.Factories$1.create(Factories.java:22)
      at org.gradle.internal.progress.DefaultBuildOperationExecutor.run(DefaultBuildOperationExecutor.java:90)
      at org.gradle.internal.progress.DefaultBuildOperationExecutor.run(DefaultBuildOperationExecutor.java:52)
      at org.gradle.initialization.DefaultGradleLauncher.doBuildStages(DefaultGradleLauncher.java:151)
      at org.gradle.initialization.DefaultGradleLauncher.access$200(DefaultGradleLauncher.java:32)
      at org.gradle.initialization.DefaultGradleLauncher$1.create(DefaultGradleLauncher.java:99)
      at org.gradle.initialization.DefaultGradleLauncher$1.create(DefaultGradleLauncher.java:93)
      at org.gradle.internal.progress.DefaultBuildOperationExecutor.run(DefaultBuildOperationExecutor.java:90)
      at org.gradle.internal.progress.DefaultBuildOperationExecutor.run(DefaultBuildOperationExecutor.java:62)
      at org.gradle.initialization.DefaultGradleLauncher.doBuild(DefaultGradleLauncher.java:93)
      at org.gradle.initialization.DefaultGradleLauncher.run(DefaultGradleLauncher.java:82)
      at org.gradle.launcher.exec.InProcessBuildActionExecuter$DefaultBuildController.run(InProcessBuildActionExecuter.java:94)
      at org.gradle.tooling.internal.provider.runner.BuildModelActionRunner.run(BuildModelActionRunner.java:46)
      at org.gradle.launcher.exec.ChainingBuildActionRunner.run(ChainingBuildActionRunner.java:35)
      at org.gradle.tooling.internal.provider.runner.SubscribableBuildActionRunner.run(SubscribableBuildActionRunner.java:58)
      at org.gradle.launcher.exec.ChainingBuildActionRunner.run(ChainingBuildActionRunner.java:35)
      at org.gradle.launcher.exec.InProcessBuildActionExecuter.execute(InProcessBuildActionExecuter.java:43)
      at org.gradle.launcher.exec.InProcessBuildActionExecuter.execute(InProcessBuildActionExecuter.java:28)
      at org.gradle.launcher.exec.ContinuousBuildActionExecuter.execute(ContinuousBuildActionExecuter.java:78)
      at org.gradle.launcher.exec.ContinuousBuildActionExecuter.execute(ContinuousBuildActionExecuter.java:48)
      at org.gradle.launcher.daemon.server.exec.ExecuteBuild.doBuild(ExecuteBuild.java:52)
      at org.gradle.launcher.daemon.server.exec.BuildCommandOnly.execute(BuildCommandOnly.java:36)
      at org.gradle.launcher.daemon.server.api.DaemonCommandExecution.proceed(DaemonCommandExecution.java:120)
      at org.gradle.launcher.daemon.server.exec.WatchForDisconnection.execute(WatchForDisconnection.java:37)
      at org.gradle.launcher.daemon.server.api.DaemonCommandExecution.proceed(DaemonCommandExecution.java:120)
      at org.gradle.launcher.daemon.server.exec.ResetDeprecationLogger.execute(ResetDeprecationLogger.java:26)
      at org.gradle.launcher.daemon.server.api.DaemonCommandExecution.proceed(DaemonCommandExecution.java:120)
      at org.gradle.launcher.daemon.server.exec.RequestStopIfSingleUsedDaemon.execute(RequestStopIfSingleUsedDaemon.java:34)
      at org.gradle.launcher.daemon.server.api.DaemonCommandExecution.proceed(DaemonCommandExecution.java:120)
      at org.gradle.launcher.daemon.server.exec.ForwardClientInput$2.call(ForwardClientInput.java:74)
      at org.gradle.launcher.daemon.server.exec.ForwardClientInput$2.call(ForwardClientInput.java:72)
      at org.gradle.util.Swapper.swap(Swapper.java:38)
      at org.gradle.launcher.daemon.server.exec.ForwardClientInput.execute(ForwardClientInput.java:72)
      at org.gradle.launcher.daemon.server.api.DaemonCommandExecution.proceed(DaemonCommandExecution.java:120)
      at org.gradle.launcher.daemon.server.health.DaemonHealthTracker.execute(DaemonHealthTracker.java:47)
      at org.gradle.launcher.daemon.server.api.DaemonCommandExecution.proceed(DaemonCommandExecution.java:120)
      at org.gradle.launcher.daemon.server.exec.LogToClient.doBuild(LogToClient.java:66)
      at org.gradle.launcher.daemon.server.exec.BuildCommandOnly.execute(BuildCommandOnly.java:36)
      at org.gradle.launcher.daemon.server.api.DaemonCommandExecution.proceed(DaemonCommandExecution.java:120)
      at org.gradle.launcher.daemon.server.exec.EstablishBuildEnvironment.doBuild(EstablishBuildEnvironment.java:72)
      at org.gradle.launcher.daemon.server.exec.BuildCommandOnly.execute(BuildCommandOnly.java:36)
      at org.gradle.launcher.daemon.server.api.DaemonCommandExecution.proceed(DaemonCommandExecution.java:120)
      at org.gradle.launcher.daemon.server.health.HintGCAfterBuild.execute(HintGCAfterBuild.java:41)
      at org.gradle.launcher.daemon.server.api.DaemonCommandExecution.proceed(DaemonCommandExecution.java:120)
      at org.gradle.launcher.daemon.server.exec.StartBuildOrRespondWithBusy$1.run(StartBuildOrRespondWithBusy.java:50)
      at org.gradle.launcher.daemon.server.DaemonStateCoordinator$1.run(DaemonStateCoordinator.java:246)
      at org.gradle.internal.concurrent.ExecutorPolicy$CatchAndRecordFailures.onExecute(ExecutorPolicy.java:54)
      at org.gradle.internal.concurrent.StoppableExecutorImpl$1.run(StoppableExecutorImpl.java:40)
      at java.util.concurrent.ThreadPoolExecutor.runWorker(ThreadPoolExecutor.java:1110)
      at java.util.concurrent.ThreadPoolExecutor$Worker.run(ThreadPoolExecutor.java:603)
      at java.lang.Thread.run(Thread.java:722)
      Error:Execution failed for task ':app:compileDebugJavaWithJavac'.
      > Compilation failed; see the compiler error output for details.
      Information:BUILD FAILED
      Information:Total time: 16.151 secs
      Information:1 error
      Information:0 warnings
      Information:See complete output in console
      ---------- END SOURCE ----------

      CUSTOMER SUBMITTED WORKAROUND :
      Sorry don't have any.

      SUPPORT :
      YES

        Attachments

          Issue Links

            Activity

              People

              • Assignee:
                fmatte Fairoz Matte
                Reporter:
                webbuggrp Webbug Group
              • Votes:
                0 Vote for this issue
                Watchers:
                2 Start watching this issue

                Dates

                • Created:
                  Updated:
                  Resolved: