Uploaded image for project: 'JDK'
  1. JDK
  2. JDK-8200197

Zero fails to build after 8200105

    Details

    • Type: Bug
    • Status: Resolved
    • Priority: P4
    • Resolution: Fixed
    • Affects Version/s: 11
    • Fix Version/s: 11
    • Component/s: hotspot
    • Labels:
      None
    • Resolved In Build:
      b10
    • CPU:
      generic
    • OS:
      linux

      Description

      Zero fails to build after

      8200105: Remove cyclic dependency between oop.inline.hpp and collectedHeap.inline.hpp

      with the error messages below

      The attached patch gets it building again

      --- CUT HERE ---
      In file included from /home/ed/openjdk/hs/src/hotspot/share/runtime/thread.hpp:29:0,
                       from /home/ed/openjdk/hs/src/hotspot/share/utilities/events.hpp:30,
                       from /home/ed/openjdk/hs/src/hotspot/share/gc/shared/collectedHeap.hpp:35,
                       from /home/ed/openjdk/hs/src/hotspot/share/interpreter/bytecodeInterpreter.cpp:27:
      /home/ed/openjdk/hs/src/hotspot/share/gc/shared/threadLocalAllocBuffer.hpp:129:20: warning: inline function 'HeapWord* ThreadLocalAllocBuffer::allocate(size_t)' used but never defined
         inline HeapWord* allocate(size_t size);
                          ^~~~~~~~
      In file included from /home/ed/openjdk/hs/src/hotspot/share/runtime/thread.hpp:29:0,
                       from /home/ed/openjdk/hs/src/hotspot/share/utilities/events.hpp:30,
                       from /home/ed/openjdk/hs/src/hotspot/share/gc/shared/collectedHeap.hpp:35,
                       from /home/ed/openjdk/hs/src/hotspot/share/interpreter/bytecodeInterpreter.cpp:27,
                       from /home/ed/openjdk/hs/build/linux-x86_64-normal-zero-release/hotspot/variant-zero/gensrc/jvmtifiles/bytecodeInterpreterWithChecks.cpp:3:
      /home/ed/openjdk/hs/src/hotspot/share/gc/shared/threadLocalAllocBuffer.hpp:129:20: warning: inline function 'HeapWord* ThreadLocalAllocBuffer::allocate(size_t)' used but never defined
         inline HeapWord* allocate(size_t size);
                          ^~~~~~~~
      /home/ed/openjdk/hs/build/linux-x86_64-normal-zero-release/hotspot/variant-zero/libjvm/objs/bytecodeInterpreter.o: In function `BytecodeInterpreter::run(BytecodeInterpreter*)':
      /home/ed/openjdk/hs/src/hotspot/share/interpreter/bytecodeInterpreter.cpp:2151: undefined reference to `ThreadLocalAllocBuffer::allocate(unsigned long)'
      /home/ed/openjdk/hs/build/linux-x86_64-normal-zero-release/hotspot/variant-zero/libjvm/objs/bytecodeInterpreterWithChecks.o: In function `BytecodeInterpreter::runWithChecks(BytecodeInterpreter*)':
      /home/ed/openjdk/hs/src/hotspot/share/interpreter/bytecodeInterpreter.cpp:2151: undefined reference to `ThreadLocalAllocBuffer::allocate(unsigned long)'
      collect2: error: ld returned 1 exit status
      lib/CompileJvm.gmk:212: recipe for target '/home/ed/openjdk/hs/build/linux-x86_64-normal-zero-release/support/modules_libs/java.base/server/libjvm.so' failed
      gmake[3]: *** [/home/ed/openjdk/hs/build/linux-x86_64-normal-zero-release/support/modules_libs/java.base/server/libjvm.so] Error 1
      gmake[3]: *** Waiting for unfinished jobs....
      /home/ed/openjdk/hs/build/linux-x86_64-normal-zero-release/hotspot/variant-zero/libjvm/objs/bytecodeInterpreter.o: In function `BytecodeInterpreter::run(BytecodeInterpreter*)':
      /home/ed/openjdk/hs/src/hotspot/share/interpreter/bytecodeInterpreter.cpp:2151: undefined reference to `ThreadLocalAllocBuffer::allocate(unsigned long)'
      /home/ed/openjdk/hs/build/linux-x86_64-normal-zero-release/hotspot/variant-zero/libjvm/objs/bytecodeInterpreterWithChecks.o: In function `BytecodeInterpreter::runWithChecks(BytecodeInterpreter*)':
      /home/ed/openjdk/hs/src/hotspot/share/interpreter/bytecodeInterpreter.cpp:2151: undefined reference to `ThreadLocalAllocBuffer::allocate(unsigned long)'
      collect2: error: ld returned 1 exit status
      lib/CompileGtest.gmk:65: recipe for target '/home/ed/openjdk/hs/build/linux-x86_64-normal-zero-release/hotspot/variant-zero/libjvm/gtest/libjvm.so' failed
      gmake[3]: *** [/home/ed/openjdk/hs/build/linux-x86_64-normal-zero-release/hotspot/variant-zero/libjvm/gtest/libjvm.so] Error 1
      make/Main.gmk:267: recipe for target 'hotspot-zero-libs' failed
      gmake[2]: *** [hotspot-zero-libs] Error 2

      ERROR: Build failed for target 'jdk' in configuration 'linux-x86_64-normal-zero-release' (exit code 2)

      === Output from failing command(s) repeated here ===
      * For target hotspot_variant-zero_libjvm_gtest_objs_BUILD_GTEST_LIBJVM_link:
      /home/ed/openjdk/hs/build/linux-x86_64-normal-zero-release/hotspot/variant-zero/libjvm/objs/bytecodeInterpreter.o: In function `BytecodeInterpreter::run(BytecodeInterpreter*)':
      /home/ed/openjdk/hs/src/hotspot/share/interpreter/bytecodeInterpreter.cpp:2151: undefined reference to `ThreadLocalAllocBuffer::allocate(unsigned long)'
      /home/ed/openjdk/hs/build/linux-x86_64-normal-zero-release/hotspot/variant-zero/libjvm/objs/bytecodeInterpreterWithChecks.o: In function `BytecodeInterpreter::runWithChecks(BytecodeInterpreter*)':
      /home/ed/openjdk/hs/src/hotspot/share/interpreter/bytecodeInterpreter.cpp:2151: undefined reference to `ThreadLocalAllocBuffer::allocate(unsigned long)'
      collect2: error: ld returned 1 exit status
      * For target hotspot_variant-zero_libjvm_objs_BUILD_LIBJVM_link:
      /home/ed/openjdk/hs/build/linux-x86_64-normal-zero-release/hotspot/variant-zero/libjvm/objs/bytecodeInterpreter.o: In function `BytecodeInterpreter::run(BytecodeInterpreter*)':
      /home/ed/openjdk/hs/src/hotspot/share/interpreter/bytecodeInterpreter.cpp:2151: undefined reference to `ThreadLocalAllocBuffer::allocate(unsigned long)'
      /home/ed/openjdk/hs/build/linux-x86_64-normal-zero-release/hotspot/variant-zero/libjvm/objs/bytecodeInterpreterWithChecks.o: In function `BytecodeInterpreter::runWithChecks(BytecodeInterpreter*)':
      /home/ed/openjdk/hs/src/hotspot/share/interpreter/bytecodeInterpreter.cpp:2151: undefined reference to `ThreadLocalAllocBuffer::allocate(unsigned long)'
      collect2: error: ld returned 1 exit status

      * All command lines available in /home/ed/openjdk/hs/build/linux-x86_64-normal-zero-release/make-support/failure-logs.
      === End of repeated output ===

      === Make failed targets repeated here ===
      lib/CompileJvm.gmk:212: recipe for target '/home/ed/openjdk/hs/build/linux-x86_64-normal-zero-release/support/modules_libs/java.base/server/libjvm.so' failed
      lib/CompileGtest.gmk:65: recipe for target '/home/ed/openjdk/hs/build/linux-x86_64-normal-zero-release/hotspot/variant-zero/libjvm/gtest/libjvm.so' failed
      make/Main.gmk:267: recipe for target 'hotspot-zero-libs' failed
      === End of repeated output ===

      Hint: Try searching the build log for the name of the first failed target.
      Hint: See doc/building.html#troubleshooting for assistance.

      /home/ed/openjdk/hs/make/Init.gmk:291: recipe for target 'main' failed
      make[1]: *** [main] Error 2
      /home/ed/openjdk/hs/make/Init.gmk:186: recipe for target 'jdk' failed
      make: *** [jdk] Error 2
      --- CUT HERE ---

        Attachments

          Activity

            People

            • Assignee:
              enevill Ed Nevill
              Reporter:
              enevill Ed Nevill
            • Votes:
              0 Vote for this issue
              Watchers:
              1 Start watching this issue

              Dates

              • Created:
                Updated:
                Resolved: