Uploaded image for project: 'JDK'
  1. JDK
  2. JDK-8202851

jshell ToolProviderTest.java fails with java.lang.AssertionError

    Details

    • Type: Bug
    • Status: Open
    • Priority: P4
    • Resolution: Unresolved
    • Affects Version/s: 11, 14
    • Fix Version/s: tbd_minor
    • Component/s: tools
    • Labels:
    • Environment:

      macOS

    • Subcomponent:
    • CPU:
      x86_64
    • OS:
      os_x

      Description

      Test: jdk/jshell/ToolProviderTest.java

      config StartOptionTest.setUp(): success
      test ToolProviderTest.testShowVersion(): failure
      java.lang.AssertionError: Expected standard exit code (0), but found: 1 expected [0] but found [1]
      at org.testng.Assert.fail(Assert.java:94)
      at org.testng.Assert.failNotEquals(Assert.java:496)
      at org.testng.Assert.assertEquals(Assert.java:125)
      at org.testng.Assert.assertEquals(Assert.java:372)
      at StartOptionTest.checkExit(StartOptionTest.java:104)
      at StartOptionTest.startExCoUoCeCn(StartOptionTest.java:117)
      at StartOptionTest.startCo(StartOptionTest.java:135)
      at ToolProviderTest.testShowVersion(ToolProviderTest.java:75)
      at java.base/jdk.internal.reflect.NativeMethodAccessorImpl.invoke0(Native Method)
      at java.base/jdk.internal.reflect.NativeMethodAccessorImpl.invoke(NativeMethodAccessorImpl.java:62)
      at java.base/jdk.internal.reflect.DelegatingMethodAccessorImpl.invoke(DelegatingMethodAccessorImpl.java:43)
      at java.base/java.lang.reflect.Method.invoke(Method.java:569)
      at org.testng.internal.MethodInvocationHelper.invokeMethod(MethodInvocationHelper.java:85)
      at org.testng.internal.Invoker.invokeMethod(Invoker.java:639)
      at org.testng.internal.Invoker.invokeTestMethod(Invoker.java:821)
      at org.testng.internal.Invoker.invokeTestMethods(Invoker.java:1131)
      at org.testng.internal.TestMethodWorker.invokeTestMethods(TestMethodWorker.java:124)
      at org.testng.internal.TestMethodWorker.run(TestMethodWorker.java:108)
      at org.testng.TestRunner.privateRun(TestRunner.java:773)
      at org.testng.TestRunner.run(TestRunner.java:623)
      at org.testng.SuiteRunner.runTest(SuiteRunner.java:357)
      at org.testng.SuiteRunner.runSequentially(SuiteRunner.java:352)
      at org.testng.SuiteRunner.privateRun(SuiteRunner.java:310)
      at org.testng.SuiteRunner.run(SuiteRunner.java:259)
      at org.testng.SuiteRunnerWorker.runSuite(SuiteRunnerWorker.java:52)
      at org.testng.SuiteRunnerWorker.run(SuiteRunnerWorker.java:86)
      at org.testng.TestNG.runSuitesSequentially(TestNG.java:1185)
      at org.testng.TestNG.runSuitesLocally(TestNG.java:1110)
      at org.testng.TestNG.run(TestNG.java:1018)
      at com.sun.javatest.regtest.agent.TestNGRunner.main(TestNGRunner.java:94)
      at java.base/jdk.internal.reflect.NativeMethodAccessorImpl.invoke0(Native Method)
      at java.base/jdk.internal.reflect.NativeMethodAccessorImpl.invoke(NativeMethodAccessorImpl.java:62)
      at java.base/jdk.internal.reflect.DelegatingMethodAccessorImpl.invoke(DelegatingMethodAccessorImpl.java:43)
      at java.base/java.lang.reflect.Method.invoke(Method.java:569)
      at com.sun.javatest.regtest.agent.MainActionHelper$SameVMRunnable.run(MainActionHelper.java:229)
      at java.base/java.lang.Thread.run(Thread.java:832)

      ----------System.err:(12/713)----------
      java.lang.Exception: failures: 2
      at com.sun.javatest.regtest.agent.TestNGRunner.main(TestNGRunner.java:96)
      at java.base/jdk.internal.reflect.NativeMethodAccessorImpl.invoke0(Native Method)
      at java.base/jdk.internal.reflect.NativeMethodAccessorImpl.invoke(NativeMethodAccessorImpl.java:62)
      at java.base/jdk.internal.reflect.DelegatingMethodAccessorImpl.invoke(DelegatingMethodAccessorImpl.java:43)
      at java.base/java.lang.reflect.Method.invoke(Method.java:569)
      at com.sun.javatest.regtest.agent.MainActionHelper$SameVMRunnable.run(MainActionHelper.java:229)
      at java.base/java.lang.Thread.run(Thread.java:832)

        Attachments

          Activity

            People

            • Assignee:
              rfield Robert Field
              Reporter:
              skonchad Sandeep Konchady
            • Votes:
              0 Vote for this issue
              Watchers:
              2 Start watching this issue

              Dates

              • Created:
                Updated: