Uploaded image for project: 'JDK'
  1. JDK
  2. JDK-8202960

"Bundler "EXE Installer" (exe) failed" when spaces used in app name

    Details

    • Subcomponent:
    • CPU:
      x86_64
    • OS:
      windows_10

      Description

      ADDITIONAL SYSTEM INFORMATION :
      Inno Setup 5.5.9 had been used / must be installed on the system

      A DESCRIPTION OF THE PROBLEM :
      "Bundler "EXE Installer" (exe) failed to produce a bundle." when spaces are used in the application name (Ant property fx:application name).

      build.gradle:
      project.ext.javaFXApplicationName = 'Java FXHelloWorld'

      build.xml:
      <target name="antDefineFxApplicationDetails">
      <fx:application
      name= "${gradle_ext_javaFXApplicationName}"


      REGRESSION : Last worked in version 8u172

      STEPS TO FOLLOW TO REPRODUCE THE PROBLEM :
      Create a JavaFX project and bundle it with the ant task. Use a space inside the fx:application name property in Ant, e. g. "Hello Word".

      I have a Gradle project I can send. When this project is started with "gradlew task antFxDeploy --debug" you can see the bug.

      I did not manage to run my test in java version "11-ea", but checked the fixed bugs list of 11-ea which seems not not contain this bug.

      EXPECTED VERSUS ACTUAL BEHAVIOR :
      EXPECTED -
      Build runs fine as in Java 8 (all minor releases)
      ACTUAL -
      16:17:20.423 [DEBUG] [org.gradle.api.internal.project.ant.AntLoggingAdapter] Running [D:\coding\tools\Inno Setup 5\iscc.exe, /oD:\temp\HelloWorldFX - Kopie\build\deployFX, C:\Users\username\AppData\Local\Temp\fxbundler10351231800419628950\images\win-exe.image\Java FXHelloWorld.iss] in C:\Users\username\AppData\Local\Temp\fxbundler10351231800419628950\images\win-exe.image
      16:17:20.456 [DEBUG] [org.gradle.api.internal.project.ant.AntLoggingAdapter] Inno Setup 5 Command-Line Compiler
      16:17:20.457 [DEBUG] [org.gradle.api.internal.project.ant.AntLoggingAdapter] Copyright (C) 1997-2016 Jordan Russell. All rights reserved.
      16:17:20.457 [DEBUG] [org.gradle.api.internal.project.ant.AntLoggingAdapter] Portions Copyright (C) 2000-2016 Martijn Laan
      16:17:20.457 [DEBUG] [org.gradle.api.internal.project.ant.AntLoggingAdapter] Inno Setup Preprocessor
      16:17:20.457 [DEBUG] [org.gradle.api.internal.project.ant.AntLoggingAdapter] Copyright (C) 2001-2004 Alex Yackimoff. All rights reserved.
      16:17:20.457 [DEBUG] [org.gradle.api.internal.project.ant.AntLoggingAdapter]
      16:17:20.457 [DEBUG] [org.gradle.api.internal.project.ant.AntLoggingAdapter] Compiler engine version: Inno Setup 5.5.9 (u)
      16:17:20.457 [DEBUG] [org.gradle.api.internal.project.ant.AntLoggingAdapter]
      16:17:20.459 [DEBUG] [org.gradle.api.internal.project.ant.AntLoggingAdapter] [ISPP] Preprocessing.
      16:17:20.460 [DEBUG] [org.gradle.api.internal.project.ant.AntLoggingAdapter] [ISPP] Preprocessed.
      16:17:20.460 [DEBUG] [org.gradle.api.internal.project.ant.AntLoggingAdapter]
      16:17:20.461 [DEBUG] [org.gradle.api.internal.project.ant.AntLoggingAdapter] Parsing [Setup] section, line 4
      16:17:20.461 [DEBUG] [org.gradle.api.internal.project.ant.AntLoggingAdapter] Parsing [Setup] section, line 5
      16:17:20.461 [DEBUG] [org.gradle.api.internal.project.ant.AntLoggingAdapter] Parsing [Setup] section, line 6
      16:17:20.461 [DEBUG] [org.gradle.api.internal.project.ant.AntLoggingAdapter] Parsing [Setup] section, line 7
      16:17:20.461 [DEBUG] [org.gradle.api.internal.project.ant.AntLoggingAdapter] Parsing [Setup] section, line 8
      16:17:20.461 [DEBUG] [org.gradle.api.internal.project.ant.AntLoggingAdapter] Parsing [Setup] section, line 9
      16:17:20.461 [DEBUG] [org.gradle.api.internal.project.ant.AntLoggingAdapter] Parsing [Setup] section, line 10
      16:17:20.461 [DEBUG] [org.gradle.api.internal.project.ant.AntLoggingAdapter] Parsing [Setup] section, line 14
      16:17:20.461 [DEBUG] [org.gradle.api.internal.project.ant.AntLoggingAdapter] Parsing [Setup] section, line 15
      16:17:20.461 [DEBUG] [org.gradle.api.internal.project.ant.AntLoggingAdapter] Parsing [Setup] section, line 16
      16:17:20.461 [DEBUG] [org.gradle.api.internal.project.ant.AntLoggingAdapter] Parsing [Setup] section, line 17
      16:17:20.461 [DEBUG] [org.gradle.api.internal.project.ant.AntLoggingAdapter] Parsing [Setup] section, line 18
      16:17:20.461 [DEBUG] [org.gradle.api.internal.project.ant.AntLoggingAdapter] Parsing [Setup] section, line 19
      16:17:20.461 [DEBUG] [org.gradle.api.internal.project.ant.AntLoggingAdapter] Parsing [Setup] section, line 20
      16:17:20.461 [DEBUG] [org.gradle.api.internal.project.ant.AntLoggingAdapter] Parsing [Setup] section, line 21
      16:17:20.461 [DEBUG] [org.gradle.api.internal.project.ant.AntLoggingAdapter] Parsing [Setup] section, line 23
      16:17:20.461 [DEBUG] [org.gradle.api.internal.project.ant.AntLoggingAdapter] Parsing [Setup] section, line 25
      16:17:20.461 [DEBUG] [org.gradle.api.internal.project.ant.AntLoggingAdapter] Parsing [Setup] section, line 26
      16:17:20.461 [DEBUG] [org.gradle.api.internal.project.ant.AntLoggingAdapter] Parsing [Setup] section, line 27
      16:17:20.461 [DEBUG] [org.gradle.api.internal.project.ant.AntLoggingAdapter] Parsing [Setup] section, line 28
      16:17:20.461 [DEBUG] [org.gradle.api.internal.project.ant.AntLoggingAdapter] Parsing [Setup] section, line 29
      16:17:20.461 [DEBUG] [org.gradle.api.internal.project.ant.AntLoggingAdapter] Parsing [Setup] section, line 30
      16:17:20.461 [DEBUG] [org.gradle.api.internal.project.ant.AntLoggingAdapter] Parsing [Setup] section, line 31
      16:17:20.461 [DEBUG] [org.gradle.api.internal.project.ant.AntLoggingAdapter] Parsing [Setup] section, line 32
      16:17:20.461 [DEBUG] [org.gradle.api.internal.project.ant.AntLoggingAdapter] Parsing [Setup] section, line 33
      16:17:20.461 [DEBUG] [org.gradle.api.internal.project.ant.AntLoggingAdapter] Parsing [Setup] section, line 34
      16:17:20.461 [DEBUG] [org.gradle.api.internal.project.ant.AntLoggingAdapter] Parsing [Setup] section, line 35
      16:17:20.462 [DEBUG] [org.gradle.api.internal.project.ant.AntLoggingAdapter] Reading file (WizardImageFile)
      16:17:20.462 [DEBUG] [org.gradle.api.internal.project.ant.AntLoggingAdapter] File: D:\coding\tools\Inno Setup 5\WIZMODERNIMAGE.BMP
      16:17:20.462 [DEBUG] [org.gradle.api.internal.project.ant.AntLoggingAdapter] Reading file (WizardSmallImageFile)
      16:17:20.462 [DEBUG] [org.gradle.api.internal.project.ant.AntLoggingAdapter] File: C:\Users\username\AppData\Local\Temp\fxbundler10351231800419628950\images\win-exe.image\Java FXHelloWorld-setup-icon.bmp
      16:17:20.462 [DEBUG] [org.gradle.api.internal.project.ant.AntLoggingAdapter] Preparing Setup program executable
      16:17:20.466 [DEBUG] [org.gradle.api.internal.project.ant.AntLoggingAdapter] Updating icons (SETUP.E32)
      16:17:20.482 [DEBUG] [org.gradle.api.internal.project.ant.AntLoggingAdapter] Determining language code pages
      16:17:20.482 [DEBUG] [org.gradle.api.internal.project.ant.AntLoggingAdapter] Parsing [Languages] section, line 39
      16:17:20.482 [DEBUG] [org.gradle.api.internal.project.ant.AntLoggingAdapter] File: D:\coding\tools\Inno Setup 5\Default.isl
      16:17:20.482 [DEBUG] [org.gradle.api.internal.project.ant.AntLoggingAdapter] Messages in script file
      16:17:20.483 [DEBUG] [org.gradle.api.internal.project.ant.AntLoggingAdapter] Reading default messages from Default.isl
      16:17:20.483 [DEBUG] [org.gradle.api.internal.project.ant.AntLoggingAdapter] Parsing [Languages] section, line 39
      16:17:20.483 [DEBUG] [org.gradle.api.internal.project.ant.AntLoggingAdapter] File: D:\coding\tools\Inno Setup 5\Default.isl
      16:17:20.484 [DEBUG] [org.gradle.api.internal.project.ant.AntLoggingAdapter] Parsing [LangOptions], [Messages], and [CustomMessages] sections
      16:17:20.484 [DEBUG] [org.gradle.api.internal.project.ant.AntLoggingAdapter] Messages in script file
      16:17:20.484 [DEBUG] [org.gradle.api.internal.project.ant.AntLoggingAdapter] Reading [Code] section
      16:17:20.484 [DEBUG] [org.gradle.api.internal.project.ant.AntLoggingAdapter] Parsing [Icons] section, line 46
      16:17:20.484 [DEBUG] [org.gradle.api.internal.project.ant.AntLoggingAdapter] Parsing [Icons] section, line 47
      16:17:20.484 [DEBUG] [org.gradle.api.internal.project.ant.AntLoggingAdapter] Parsing [Run] section, line 51
      16:17:20.484 [DEBUG] [org.gradle.api.internal.project.ant.AntLoggingAdapter] Parsing [Run] section, line 52
      16:17:20.484 [DEBUG] [org.gradle.api.internal.project.ant.AntLoggingAdapter] Parsing [Run] section, line 53
      16:17:20.484 [DEBUG] [org.gradle.api.internal.project.ant.AntLoggingAdapter] Parsing [UninstallRun] section, line 56
      16:17:20.484 [DEBUG] [org.gradle.api.internal.project.ant.AntLoggingAdapter] Parsing [Files] section, line 42
      16:17:20.485 [DEBUG] [org.gradle.api.internal.project.ant.AntLoggingAdapter] Error on line 42 in C:\Users\username\AppData\Local\Temp\fxbundler10351231800419628950\images\win-exe.image\Java FXHelloWorld.iss: Source file "C:\Users\username\AppData\Local\Temp\fxbundler10351231800419628950\images\win-exe.image\Java FXHelloWorld\Java FXHelloWorld.exe" does not exist.
      16:17:20.485 [DEBUG] [org.gradle.api.internal.project.ant.AntLoggingAdapter] Compile aborted.
      16:17:20.492 [ERROR] [system.err] java.io.IOException: Exec failed with code 2 command [[D:\coding\tools\Inno Setup 5\iscc.exe, /oD:\temp\HelloWorldFX - Kopie\build\deployFX, C:\Users\username\AppData\Local\Temp\fxbundler10351231800419628950\images\win-exe.image\Java FXHelloWorld.iss] in C:\Users\username\AppData\Local\Temp\fxbundler10351231800419628950\images\win-exe.image
      16:17:20.493 [ERROR] [system.err] at jdk.packager/com.oracle.tools.packager.IOUtils.exec(IOUtils.java:215)
      16:17:20.493 [ERROR] [system.err] at jdk.packager/com.oracle.tools.packager.IOUtils.exec(IOUtils.java:188)
      16:17:20.493 [ERROR] [system.err] at jdk.packager/com.oracle.tools.packager.IOUtils.exec(IOUtils.java:182)
      16:17:20.493 [ERROR] [system.err] at jdk.packager/com.oracle.tools.packager.windows.WinExeBundler.buildEXE(WinExeBundler.java:704)
      16:17:20.493 [ERROR] [system.err] at jdk.packager/com.oracle.tools.packager.windows.WinExeBundler.bundle(WinExeBundler.java:372)
      16:17:20.493 [ERROR] [system.err] at jdk.packager/com.oracle.tools.packager.windows.WinExeBundler.execute(WinExeBundler.java:174)
      16:17:20.493 [ERROR] [system.err] at jdk.packager/com.sun.javafx.tools.packager.PackagerLib.generateNativeBundles(PackagerLib.java:358)
      16:17:20.493 [ERROR] [system.err] at jdk.packager/com.sun.javafx.tools.packager.PackagerLib.generateDeploymentPackages(PackagerLib.java:335)
      16:17:20.493 [ERROR] [system.err] at com.sun.javafx.tools.ant.DeployFXTask.execute(DeployFXTask.java:310)
      16:17:20.493 [ERROR] [system.err] at org.apache.tools.ant.UnknownElement.execute(UnknownElement.java:293)
      16:17:20.493 [ERROR] [system.err] at java.base/jdk.internal.reflect.NativeMethodAccessorImpl.invoke0(Native Method)
      16:17:20.493 [ERROR] [system.err] at java.base/jdk.internal.reflect.NativeMethodAccessorImpl.invoke(NativeMethodAccessorImpl.java:62)
      16:17:20.494 [ERROR] [system.err] at java.base/jdk.internal.reflect.DelegatingMethodAccessorImpl.invoke(DelegatingMethodAccessorImpl.java:43)
      16:17:20.494 [ERROR] [system.err] at java.base/java.lang.reflect.Method.invoke(Method.java:564)
      16:17:20.494 [ERROR] [system.err] at org.apache.tools.ant.dispatch.DispatchUtils.execute(DispatchUtils.java:106)
      16:17:20.494 [ERROR] [system.err] at org.apache.tools.ant.Task.perform(Task.java:348)
      16:17:20.494 [ERROR] [system.err] at org.apache.tools.ant.Target.execute(Target.java:435)
      16:17:20.494 [ERROR] [system.err] at org.apache.tools.ant.Target.performTasks(Target.java:456)
      16:17:20.494 [ERROR] [system.err] at org.gradle.api.tasks.ant.AntTarget.executeAntTarget(AntTarget.java:38)
      16:17:20.494 [ERROR] [system.err] at java.base/jdk.internal.reflect.NativeMethodAccessorImpl.invoke0(Native Method)
      16:17:20.494 [ERROR] [system.err] at java.base/jdk.internal.reflect.NativeMethodAccessorImpl.invoke(NativeMethodAccessorImpl.java:62)
      16:17:20.494 [ERROR] [system.err] at java.base/jdk.internal.reflect.DelegatingMethodAccessorImpl.invoke(DelegatingMethodAccessorImpl.java:43)
      16:17:20.494 [ERROR] [system.err] at java.base/java.lang.reflect.Method.invoke(Method.java:564)
      16:17:20.494 [ERROR] [system.err] at org.gradle.internal.reflect.JavaMethod.invoke(JavaMethod.java:73)
      16:17:20.494 [ERROR] [system.err] at org.gradle.api.internal.project.taskfactory.StandardTaskAction.doExecute(StandardTaskAction.java:46)
      16:17:20.494 [ERROR] [system.err] at org.gradle.api.internal.project.taskfactory.StandardTaskAction.execute(StandardTaskAction.java:39)
      16:17:20.494 [ERROR] [system.err] at org.gradle.api.internal.project.taskfactory.StandardTaskAction.execute(StandardTaskAction.java:26)
      16:17:20.494 [ERROR] [system.err] at org.gradle.api.internal.AbstractTask$TaskActionWrapper.execute(AbstractTask.java:794)
      16:17:20.495 [ERROR] [system.err] at org.gradle.api.internal.AbstractTask$TaskActionWrapper.execute(AbstractTask.java:761)
      16:17:20.495 [ERROR] [system.err] at org.gradle.api.internal.tasks.execution.ExecuteActionsTaskExecuter$1.run(ExecuteActionsTaskExecuter.java:124)
      16:17:20.495 [ERROR] [system.err] at org.gradle.internal.operations.DefaultBuildOperationExecutor$RunnableBuildOperationWorker.execute(DefaultBuildOperationExecutor.java:317)
      16:17:20.495 [ERROR] [system.err] at org.gradle.internal.operations.DefaultBuildOperationExecutor$RunnableBuildOperationWorker.execute(DefaultBuildOperationExecutor.java:309)
      16:17:20.495 [ERROR] [system.err] at org.gradle.internal.operations.DefaultBuildOperationExecutor.execute(DefaultBuildOperationExecutor.java:185)
      16:17:20.495 [ERROR] [system.err] at org.gradle.internal.operations.DefaultBuildOperationExecutor.run(DefaultBuildOperationExecutor.java:97)
      16:17:20.495 [ERROR] [system.err] at org.gradle.internal.operations.DelegatingBuildOperationExecutor.run(DelegatingBuildOperationExecutor.java:31)
      16:17:20.495 [ERROR] [system.err] at org.gradle.api.internal.tasks.execution.ExecuteActionsTaskExecuter.executeAction(ExecuteActionsTaskExecuter.java:113)
      16:17:20.495 [ERROR] [system.err] at org.gradle.api.internal.tasks.execution.ExecuteActionsTaskExecuter.executeActions(ExecuteActionsTaskExecuter.java:95)
      16:17:20.495 [ERROR] [system.err] at org.gradle.api.internal.tasks.execution.ExecuteActionsTaskExecuter.execute(ExecuteActionsTaskExecuter.java:73)
      16:17:20.495 [ERROR] [system.err] at org.gradle.api.internal.tasks.execution.OutputDirectoryCreatingTaskExecuter.execute(OutputDirectoryCreatingTaskExecuter.java:51)
      16:17:20.495 [ERROR] [system.err] at org.gradle.api.internal.tasks.execution.SkipUpToDateTaskExecuter.execute(SkipUpToDateTaskExecuter.java:59)
      16:17:20.495 [ERROR] [system.err] at org.gradle.api.internal.tasks.execution.ResolveTaskOutputCachingStateExecuter.execute(ResolveTaskOutputCachingStateExecuter.java:54)
      16:17:20.496 [ERROR] [system.err] at org.gradle.api.internal.tasks.execution.ValidatingTaskExecuter.execute(ValidatingTaskExecuter.java:59)
      16:17:20.496 [ERROR] [system.err] at org.gradle.api.internal.tasks.execution.SkipEmptySourceFilesTaskExecuter.execute(SkipEmptySourceFilesTaskExecuter.java:101)
      16:17:20.496 [ERROR] [system.err] at org.gradle.api.internal.tasks.execution.FinalizeInputFilePropertiesTaskExecuter.execute(FinalizeInputFilePropertiesTaskExecuter.java:44)
      16:17:20.496 [ERROR] [system.err] at org.gradle.api.internal.tasks.execution.CleanupStaleOutputsExecuter.execute(CleanupStaleOutputsExecuter.java:91)
      16:17:20.496 [ERROR] [system.err] at org.gradle.api.internal.tasks.execution.ResolveTaskArtifactStateTaskExecuter.execute(ResolveTaskArtifactStateTaskExecuter.java:62)
      16:17:20.496 [ERROR] [system.err] at org.gradle.api.internal.tasks.execution.SkipTaskWithNoActionsExecuter.execute(SkipTaskWithNoActionsExecuter.java:59)
      16:17:20.496 [ERROR] [system.err] at org.gradle.api.internal.tasks.execution.SkipOnlyIfTaskExecuter.execute(SkipOnlyIfTaskExecuter.java:54)
      16:17:20.496 [ERROR] [system.err] at org.gradle.api.internal.tasks.execution.ExecuteAtMostOnceTaskExecuter.execute(ExecuteAtMostOnceTaskExecuter.java:43)
      16:17:20.496 [ERROR] [system.err] at org.gradle.api.internal.tasks.execution.CatchExceptionTaskExecuter.execute(CatchExceptionTaskExecuter.java:34)
      16:17:20.496 [ERROR] [system.err] at org.gradle.execution.taskgraph.DefaultTaskGraphExecuter$EventFiringTaskWorker$1.run(DefaultTaskGraphExecuter.java:256)
      16:17:20.496 [ERROR] [system.err] at org.gradle.internal.operations.DefaultBuildOperationExecutor$RunnableBuildOperationWorker.execute(DefaultBuildOperationExecutor.java:317)
      16:17:20.496 [ERROR] [system.err] at org.gradle.internal.operations.DefaultBuildOperationExecutor$RunnableBuildOperationWorker.execute(DefaultBuildOperationExecutor.java:309)
      16:17:20.496 [ERROR] [system.err] at org.gradle.internal.operations.DefaultBuildOperationExecutor.execute(DefaultBuildOperationExecutor.java:185)
      16:17:20.497 [ERROR] [system.err] at org.gradle.internal.operations.DefaultBuildOperationExecutor.run(DefaultBuildOperationExecutor.java:97)
      16:17:20.497 [ERROR] [system.err] at org.gradle.internal.operations.DelegatingBuildOperationExecutor.run(DelegatingBuildOperationExecutor.java:31)
      16:17:20.497 [ERROR] [system.err] at org.gradle.execution.taskgraph.DefaultTaskGraphExecuter$EventFiringTaskWorker.execute(DefaultTaskGraphExecuter.java:249)
      16:17:20.497 [ERROR] [system.err] at org.gradle.execution.taskgraph.DefaultTaskGraphExecuter$EventFiringTaskWorker.execute(DefaultTaskGraphExecuter.java:238)
      16:17:20.497 [ERROR] [system.err] at org.gradle.execution.taskgraph.DefaultTaskPlanExecutor$TaskExecutorWorker$1.execute(DefaultTaskPlanExecutor.java:104)
      16:17:20.497 [ERROR] [system.err] at org.gradle.execution.taskgraph.DefaultTaskPlanExecutor$TaskExecutorWorker$1.execute(DefaultTaskPlanExecutor.java:98)
      16:17:20.497 [ERROR] [system.err] at org.gradle.execution.taskgraph.DefaultTaskExecutionPlan.execute(DefaultTaskExecutionPlan.java:663)
      16:17:20.497 [ERROR] [system.err] at org.gradle.execution.taskgraph.DefaultTaskExecutionPlan.executeWithTask(DefaultTaskExecutionPlan.java:596)
      16:17:20.497 [ERROR] [system.err] at org.gradle.execution.taskgraph.DefaultTaskPlanExecutor$TaskExecutorWorker.run(DefaultTaskPlanExecutor.java:98)
      16:17:20.497 [ERROR] [system.err] at org.gradle.internal.concurrent.ExecutorPolicy$CatchAndRecordFailures.onExecute(ExecutorPolicy.java:63)
      16:17:20.497 [ERROR] [system.err] at org.gradle.internal.concurrent.ManagedExecutorImpl$1.run(ManagedExecutorImpl.java:46)
      16:17:20.498 [ERROR] [system.err] at java.base/java.util.concurrent.ThreadPoolExecutor.runWorker(ThreadPoolExecutor.java:1135)
      16:17:20.498 [ERROR] [system.err] at java.base/java.util.concurrent.ThreadPoolExecutor$Worker.run(ThreadPoolExecutor.java:635)
      16:17:20.498 [ERROR] [system.err] at org.gradle.internal.concurrent.ThreadFactoryImpl$ManagedThreadRunnable.run(ThreadFactoryImpl.java:55)
      16:17:20.498 [ERROR] [system.err] at java.base/java.lang.Thread.run(Thread.java:844)
      16:17:21.088 [DEBUG] [org.gradle.api.internal.project.ant.AntLoggingAdapter] Project base dir set to: D:\temp\HelloWorldFX - Kopie
      16:17:21.088 [DEBUG] [org.gradle.internal.operations.DefaultBuildOperationExecutor] Completing Build operation 'Execute executeAntTarget for :antFxDeploy'
      16:17:21.088 [DEBUG] [org.gradle.internal.operations.DefaultBuildOperationExecutor] Build operation 'Execute executeAntTarget for :antFxDeploy' completed
      16:17:21.088 [DEBUG] [org.gradle.api.internal.changedetection.state.CacheBackedTaskHistoryRepository] Snapshotting property $1 (OUTPUT) for task ':antFxDeploy'
      16:17:21.089 [DEBUG] [org.gradle.api.internal.tasks.execution.ResolveTaskArtifactStateTaskExecuter] Removed task artifact state for {} from context.
      16:17:21.089 [DEBUG] [org.gradle.api.internal.tasks.execution.ExecuteAtMostOnceTaskExecuter] Finished executing task ':antFxDeploy'
      16:17:21.089 [DEBUG] [org.gradle.internal.operations.DefaultBuildOperationExecutor] Completing Build operation 'Task :antFxDeploy'
      16:17:21.029 [LIFECYCLE] [org.gradle.internal.operations.DefaultBuildOperationExecutor]
      16:17:21.029 [LIFECYCLE] [org.gradle.internal.operations.DefaultBuildOperationExecutor] > Task :antFxDeploy FAILED
      16:17:21.089 [DEBUG] [org.gradle.internal.operations.DefaultBuildOperationExecutor] Build operation 'Task :antFxDeploy' completed
      16:17:21.089 [INFO] [org.gradle.execution.taskgraph.DefaultTaskPlanExecutor] :antFxDeploy (Thread[Task worker for ':',5,main]) completed. Took 7.567 secs.
      16:17:21.089 [DEBUG] [org.gradle.internal.work.DefaultWorkerLeaseService] Worker lease root.1.2 completed (1 worker(s) in use)
      16:17:21.089 [DEBUG] [org.gradle.internal.resources.AbstractTrackedResourceLock] Task worker for ':': released lock on root.1.2
      16:17:21.089 [DEBUG] [org.gradle.internal.resources.AbstractTrackedResourceLock] Task worker for ':': released lock on :
      16:17:21.089 [DEBUG] [org.gradle.execution.taskgraph.DefaultTaskPlanExecutor] Task worker [Thread[Task worker for ':',5,main]] finished, busy: 7.847 secs, idle: 0.035 secs
      16:17:21.089 [DEBUG] [org.gradle.internal.operations.DefaultBuildOperationExecutor] Completing Build operation 'Run tasks'
      16:17:21.090 [DEBUG] [org.gradle.internal.operations.DefaultBuildOperationExecutor] Build operation 'Run tasks' completed
      16:17:21.091 [ERROR] [org.gradle.internal.buildevents.BuildExceptionReporter]
      16:17:21.091 [ERROR] [org.gradle.internal.buildevents.BuildExceptionReporter] FAILURE: Build failed with an exception.
      16:17:21.091 [ERROR] [org.gradle.internal.buildevents.BuildExceptionReporter]
      16:17:21.091 [ERROR] [org.gradle.internal.buildevents.BuildExceptionReporter] * What went wrong:
      16:17:21.091 [ERROR] [org.gradle.internal.buildevents.BuildExceptionReporter] Execution failed for task ':antFxDeploy'.
      16:17:21.091 [ERROR] [org.gradle.internal.buildevents.BuildExceptionReporter] > Error: Bundler "EXE Installer" (exe) failed to produce a bundle.
      16:17:21.091 [ERROR] [org.gradle.internal.buildevents.BuildExceptionReporter]
      16:17:21.091 [ERROR] [org.gradle.internal.buildevents.BuildExceptionReporter] * Try:
      16:17:21.091 [ERROR] [org.gradle.internal.buildevents.BuildExceptionReporter] Run with --stacktrace option to get the stack trace. Run with --scan to get full insights.
      16:17:21.091 [ERROR] [org.gradle.internal.buildevents.BuildExceptionReporter]
      16:17:21.091 [ERROR] [org.gradle.internal.buildevents.BuildExceptionReporter] * Get more help at https://help.gradle.org
      16:17:21.091 [ERROR] [org.gradle.internal.buildevents.BuildResultLogger]

      ---------- BEGIN SOURCE ----------
      I can send a ZIP file with a simplified gradle project
      ---------- END SOURCE ----------

      CUSTOMER SUBMITTED WORKAROUND :
      remove the space in the application name in the ant task. This has the implication that the application had to be de-installed at all users machine before a fresh installation can be made instead of only updating the application.

      FREQUENCY : always


        Attachments

          Activity

            People

            • Assignee:
              vdrozdov Victor Drozdov (Inactive)
              Reporter:
              webbuggrp Webbug Group
            • Votes:
              0 Vote for this issue
              Watchers:
              4 Start watching this issue

              Dates

              • Created:
                Updated:
                Resolved: