Uploaded image for project: 'JDK'
  1. JDK
  2. JDK-8204274

[GRAAL] compiler/stable/TestStableShort.java test failed

    Details

    • Type: Bug
    • Status: Closed
    • Priority: P2
    • Resolution: Duplicate
    • Affects Version/s: 11
    • Fix Version/s: None
    • Component/s: hotspot

      Description

      compiler/stable/TestStableShort.java test failed

      ----------messages:(5/708)----------
      command: main -XX:+UnlockDiagnosticVMOptions -XX:+WhiteBoxAPI -Xcomp -XX:CompileOnly=::get,::get1,::get2,::get3,::get4 -XX:-TieredCompilation -XX:+FoldStableValues compiler.stable.TestStableShort
      reason: User specified action: run main/bootclasspath/othervm -XX:+UnlockDiagnosticVMOptions -XX:+WhiteBoxAPI -Xcomp -XX:CompileOnly=::get,::get1,::get2,::get3,::get4 -XX:-TieredCompilation -XX:+FoldStableValues compiler.stable.TestStableShort
      Mode: othervm [/bootclasspath specified, /othervm specified]
      Additional options from @modules: --add-modules java.base --add-exports java.base/jdk.internal.misc=ALL-UNNAMED --add-exports java.base/jdk.internal.vm.annotation=ALL-UNNAMED
      elapsed time (seconds): 31.097
      ----------configuration:(5/193)----------
      Boot Layer
        add modules: java.base
        add exports: java.base/jdk.internal.misc ALL-UNNAMED
                     java.base/jdk.internal.vm.annotation ALL-UNNAMED

      ----------System.out:(32/2116)----------
      @Stable: enabled
      compiler.stable.TestStableShort$DefaultValue: PASSED
      compiler.stable.TestStableShort$ShortStable: FAILED
      java.lang.AssertionError: 32767 != 1
      at compiler.stable.TestStableShort.assertEquals(TestStableShort.java:598)
      at compiler.stable.TestStableShort$ShortStable.test(TestStableShort.java:121)
      at java.base/jdk.internal.reflect.NativeMethodAccessorImpl.invoke0(Native Method)
      at java.base/jdk.internal.reflect.NativeMethodAccessorImpl.invoke(NativeMethodAccessorImpl.java:62)
      at java.base/jdk.internal.reflect.DelegatingMethodAccessorImpl.invoke(DelegatingMethodAccessorImpl.java:43)
      at java.base/java.lang.reflect.Method.invoke(Method.java:566)
      at compiler.stable.TestStableShort.run(TestStableShort.java:607)
      at compiler.stable.TestStableShort.main(TestStableShort.java:68)
      at java.base/jdk.internal.reflect.NativeMethodAccessorImpl.invoke0(Native Method)
      at java.base/jdk.internal.reflect.NativeMethodAccessorImpl.invoke(NativeMethodAccessorImpl.java:62)
      at java.base/jdk.internal.reflect.DelegatingMethodAccessorImpl.invoke(DelegatingMethodAccessorImpl.java:43)
      at java.base/java.lang.reflect.Method.invoke(Method.java:566)
      at com.sun.javatest.regtest.agent.MainWrapper$MainThread.run(MainWrapper.java:115)
      at java.base/java.lang.Thread.run(Thread.java:832)
      compiler.stable.TestStableShort$DefaultStaticValue: PASSED
      compiler.stable.TestStableShort$StaticShortStable: PASSED
      compiler.stable.TestStableShort$VolatileShortStable: PASSED
      compiler.stable.TestStableShort$ShortArrayDim1: PASSED
      compiler.stable.TestStableShort$ShortArrayDim2: PASSED
      compiler.stable.TestStableShort$ShortArrayDim3: PASSED
      compiler.stable.TestStableShort$ShortArrayDim4: PASSED
      compiler.stable.TestStableShort$ObjectArrayLowerDim0: PASSED
      compiler.stable.TestStableShort$ObjectArrayLowerDim1: PASSED
      compiler.stable.TestStableShort$ObjectArrayLowerDim2: PASSED
      compiler.stable.TestStableShort$NestedStableField: PASSED
      compiler.stable.TestStableShort$NestedStableField1: PASSED
      compiler.stable.TestStableShort$NestedStableField2: PASSED
      compiler.stable.TestStableShort$NestedStableField3: PASSED
      ----------System.err:(13/762)----------
      java.lang.Error: TEST FAILED
      at compiler.stable.TestStableShort.main(TestStableShort.java:91)
      at java.base/jdk.internal.reflect.NativeMethodAccessorImpl.invoke0(Native Method)
      at java.base/jdk.internal.reflect.NativeMethodAccessorImpl.invoke(NativeMethodAccessorImpl.java:62)
      at java.base/jdk.internal.reflect.DelegatingMethodAccessorImpl.invoke(DelegatingMethodAccessorImpl.java:43)
      at java.base/java.lang.reflect.Method.invoke(Method.java:566)
      at com.sun.javatest.regtest.agent.MainWrapper$MainThread.run(MainWrapper.java:115)
      at java.base/java.lang.Thread.run(Thread.java:832)

      JavaTest Message: Test threw exception: java.lang.Error: TEST FAILED
      JavaTest Message: shutting down test

      STATUS:Failed.`main' threw exception: java.lang.Error: TEST FAILED

        Attachments

          Issue Links

            Activity

              People

              • Assignee:
                kvn Vladimir Kozlov
                Reporter:
                jwang Joy Wang (Inactive)
              • Votes:
                0 Vote for this issue
                Watchers:
                3 Start watching this issue

                Dates

                • Created:
                  Updated:
                  Resolved: