Uploaded image for project: 'JDK'
  1. JDK
  2. JDK-8205135

serviceability/sa/ClhsdbScanOops.java failed with 'java/lang/Object' missing from stdout/stderr

    Details

    • Type: Bug
    • Status: Closed
    • Priority: P4
    • Resolution: Duplicate
    • Affects Version/s: 11
    • Fix Version/s: None
    • Component/s: hotspot
    • Labels:
    • Subcomponent:
    • CPU:
      sparc
    • OS:
      solaris

      Description

      serviceability/sa/ClhsdbScanOops.java failed with below error:
      Attaching to process 11102, please wait...
      javax.script.ScriptException: TypeError: sapkg.runtime.VM.getVM is not a function in sa.js at line number 54
      javax.script.ScriptException: TypeError: sapkg.runtime.VM.getVM is not a function in sa.js at line number 54
      Attaching to process 11102, please wait...
      Unable to connect to process ID 11102:

      Can't create thread_db agent! td_ta_new failed: 15
      sun.jvm.hotspot.debugger.DebuggerException: Can't create thread_db agent! td_ta_new failed: 15
      at jdk.hotspot.agent/sun.jvm.hotspot.debugger.proc.ProcDebuggerLocal.attach0(Native Method)
      at jdk.hotspot.agent/sun.jvm.hotspot.debugger.proc.ProcDebuggerLocal.attach(ProcDebuggerLocal.java:146)
      at jdk.hotspot.agent/sun.jvm.hotspot.HotSpotAgent.attachDebugger(HotSpotAgent.java:672)
      at jdk.hotspot.agent/sun.jvm.hotspot.HotSpotAgent.setupDebuggerSolaris(HotSpotAgent.java:488)
      at jdk.hotspot.agent/sun.jvm.hotspot.HotSpotAgent.setupDebugger(HotSpotAgent.java:334)
      at jdk.hotspot.agent/sun.jvm.hotspot.HotSpotAgent.go(HotSpotAgent.java:305)
      at jdk.hotspot.agent/sun.jvm.hotspot.HotSpotAgent.attach(HotSpotAgent.java:141)
      at jdk.hotspot.agent/sun.jvm.hotspot.CLHSDB.attachDebugger(CLHSDB.java:180)
      at jdk.hotspot.agent/sun.jvm.hotspot.CLHSDB.run(CLHSDB.java:61)
      at jdk.hotspot.agent/sun.jvm.hotspot.CLHSDB.main(CLHSDB.java:40)
      at jdk.hotspot.agent/sun.jvm.hotspot.SALauncher.runCLHSDB(SALauncher.java:191)
      at jdk.hotspot.agent/sun.jvm.hotspot.SALauncher.main(SALauncher.java:439)
       stdout: [ Command not valid until attached to a VM
      ];
       stderr: [ Command not valid until attached to a VM
      ]
       exitValue = -1

       LingeredApp stdout: [];
       LingeredApp stderr: []
       LingeredApp exitValue = 0
      java.lang.Error: Test failed with java.lang.RuntimeException: Test ERROR java.lang.RuntimeException: 'java/lang/Object' missing from stdout/stderr

      at ClhsdbScanOops.main(ClhsdbScanOops.java:112)
      at java.base/jdk.internal.reflect.NativeMethodAccessorImpl.invoke0(Native Method)
      at java.base/jdk.internal.reflect.NativeMethodAccessorImpl.invoke(NativeMethodAccessorImpl.java:62)
      at java.base/jdk.internal.reflect.DelegatingMethodAccessorImpl.invoke(DelegatingMethodAccessorImpl.java:43)
      at java.base/java.lang.reflect.Method.invoke(Method.java:566)
      at com.sun.javatest.regtest.agent.MainWrapper$MainThread.run(MainWrapper.java:115)
      at java.base/java.lang.Thread.run(Thread.java:832)

      JavaTest Message: Test threw exception: java.lang.Error: Test failed with java.lang.RuntimeException: Test ERROR java.lang.RuntimeException: 'java/lang/Object' missing from stdout/stderr

      JavaTest Message: shutting down test

      STATUS:Failed.`main' threw exception: java.lang.Error: Test failed with java.lang.RuntimeException: Test ERROR java.lang.RuntimeException: 'java/lang/Object' missing from stdout/stderr

        Attachments

          Issue Links

            Activity

              People

              • Assignee:
                Unassigned
                Reporter:
                dzhou Dora Zhou
              • Votes:
                0 Vote for this issue
                Watchers:
                1 Start watching this issue

                Dates

                • Created:
                  Updated:
                  Resolved: