Uploaded image for project: 'JDK'
  1. JDK
  2. JDK-8206917

NPE at jdk.compiler/com.sun.tools.javac.comp.Flow$FlowAnalyzer.visitApply(Flow.java:1233)

    XMLWordPrintable

    Details

    • Subcomponent:
    • CPU:
      x86_64
    • OS:
      os_x

      Description

      ADDITIONAL SYSTEM INFORMATION :
      MBP 2017, MacOS High Sierra 10.13.5, JDK 10.0.1

      A DESCRIPTION OF THE PROBLEM :
      An exception has occurred in the compiler (10.0.1). Please file a bug against the Java compiler via the Java bug reporting page (http://bugreport.java.com) after checking the Bug Database (http://bugs.java.com) for duplicates. Include your program and the following diagnostic in your report. Thank you.
      java.lang.NullPointerException
      at jdk.compiler/com.sun.tools.javac.comp.Flow$FlowAnalyzer.visitApply(Flow.java:1233)
      at jdk.compiler/com.sun.tools.javac.tree.JCTree$JCMethodInvocation.accept(JCTree.java:1634)
      at jdk.compiler/com.sun.tools.javac.tree.TreeScanner.scan(TreeScanner.java:49)
      at jdk.compiler/com.sun.tools.javac.comp.Flow$BaseAnalyzer.scan(Flow.java:396)
      at jdk.compiler/com.sun.tools.javac.comp.Flow$FlowAnalyzer.visitVarDef(Flow.java:987)
      at jdk.compiler/com.sun.tools.javac.tree.JCTree$JCVariableDecl.accept(JCTree.java:956)
      at jdk.compiler/com.sun.tools.javac.tree.TreeScanner.scan(TreeScanner.java:49)
      at jdk.compiler/com.sun.tools.javac.comp.Flow$BaseAnalyzer.scan(Flow.java:396)
      at jdk.compiler/com.sun.tools.javac.tree.TreeScanner.scan(TreeScanner.java:57)
      at jdk.compiler/com.sun.tools.javac.comp.Flow$FlowAnalyzer.visitBlock(Flow.java:995)
      at jdk.compiler/com.sun.tools.javac.tree.JCTree$JCBlock.accept(JCTree.java:1020)
      at jdk.compiler/com.sun.tools.javac.tree.TreeScanner.scan(TreeScanner.java:49)
      at jdk.compiler/com.sun.tools.javac.comp.Flow$BaseAnalyzer.scan(Flow.java:396)
      at jdk.compiler/com.sun.tools.javac.comp.Flow$FlowAnalyzer.visitMethodDef(Flow.java:962)
      at jdk.compiler/com.sun.tools.javac.tree.JCTree$JCMethodDecl.accept(JCTree.java:866)
      at jdk.compiler/com.sun.tools.javac.tree.TreeScanner.scan(TreeScanner.java:49)
      at jdk.compiler/com.sun.tools.javac.comp.Flow$BaseAnalyzer.scan(Flow.java:396)
      at jdk.compiler/com.sun.tools.javac.comp.Flow$FlowAnalyzer.visitClassDef(Flow.java:925)
      at jdk.compiler/com.sun.tools.javac.tree.JCTree$JCClassDecl.accept(JCTree.java:774)
      at jdk.compiler/com.sun.tools.javac.tree.TreeScanner.scan(TreeScanner.java:49)
      at jdk.compiler/com.sun.tools.javac.comp.Flow$BaseAnalyzer.scan(Flow.java:396)
      at jdk.compiler/com.sun.tools.javac.comp.Flow$FlowAnalyzer.analyzeTree(Flow.java:1325)
      at jdk.compiler/com.sun.tools.javac.comp.Flow$FlowAnalyzer.analyzeTree(Flow.java:1315)
      at jdk.compiler/com.sun.tools.javac.comp.Flow.analyzeTree(Flow.java:216)
      at jdk.compiler/com.sun.tools.javac.main.JavaCompiler.flow(JavaCompiler.java:1393)
      at jdk.compiler/com.sun.tools.javac.main.JavaCompiler.flow(JavaCompiler.java:1367)
      at jdk.compiler/com.sun.tools.javac.main.JavaCompiler.compile(JavaCompiler.java:965)
      at jdk.compiler/com.sun.tools.javac.api.JavacTaskImpl.lambda$doCall$0(JavacTaskImpl.java:100)
      at jdk.compiler/com.sun.tools.javac.api.JavacTaskImpl.handleExceptions(JavacTaskImpl.java:142)
      at jdk.compiler/com.sun.tools.javac.api.JavacTaskImpl.doCall(JavacTaskImpl.java:96)
      at jdk.compiler/com.sun.tools.javac.api.JavacTaskImpl.call(JavacTaskImpl.java:90)
      at org.codehaus.plexus.compiler.javac.JavaxToolsCompiler.compileInProcess(JavaxToolsCompiler.java:126)
      at org.codehaus.plexus.compiler.javac.JavacCompiler.performCompile(JavacCompiler.java:174)
      at org.apache.maven.plugin.compiler.AbstractCompilerMojo.execute(AbstractCompilerMojo.java:1075)
      at org.apache.maven.plugin.compiler.CompilerMojo.execute(CompilerMojo.java:168)
      at org.apache.maven.plugin.DefaultBuildPluginManager.executeMojo(DefaultBuildPluginManager.java:134)
      at org.apache.maven.lifecycle.internal.MojoExecutor.execute(MojoExecutor.java:207)
      at org.apache.maven.lifecycle.internal.MojoExecutor.execute(MojoExecutor.java:153)
      at org.apache.maven.lifecycle.internal.MojoExecutor.execute(MojoExecutor.java:145)
      at org.apache.maven.lifecycle.internal.LifecycleModuleBuilder.buildProject(LifecycleModuleBuilder.java:116)
      at org.apache.maven.lifecycle.internal.LifecycleModuleBuilder.buildProject(LifecycleModuleBuilder.java:80)
      at org.apache.maven.lifecycle.internal.builder.singlethreaded.SingleThreadedBuilder.build(SingleThreadedBuilder.java:51)
      at org.apache.maven.lifecycle.internal.LifecycleStarter.execute(LifecycleStarter.java:128)
      at org.apache.maven.DefaultMaven.doExecute(DefaultMaven.java:307)
      at org.apache.maven.DefaultMaven.doExecute(DefaultMaven.java:193)
      at org.apache.maven.DefaultMaven.execute(DefaultMaven.java:106)
      at org.apache.maven.cli.MavenCli.execute(MavenCli.java:863)
      at org.apache.maven.cli.MavenCli.doMain(MavenCli.java:288)
      at org.apache.maven.cli.MavenCli.main(MavenCli.java:199)
      at java.base/jdk.internal.reflect.NativeMethodAccessorImpl.invoke0(Native Method)
      at java.base/jdk.internal.reflect.NativeMethodAccessorImpl.invoke(NativeMethodAccessorImpl.java:62)
      at java.base/jdk.internal.reflect.DelegatingMethodAccessorImpl.invoke(DelegatingMethodAccessorImpl.java:43)
      at java.base/java.lang.reflect.Method.invoke(Method.java:564)
      at org.codehaus.plexus.classworlds.launcher.Launcher.launchEnhanced(Launcher.java:289)
      at org.codehaus.plexus.classworlds.launcher.Launcher.launch(Launcher.java:229)
      at org.codehaus.plexus.classworlds.launcher.Launcher.mainWithExitCode(Launcher.java:415)
      at org.codehaus.plexus.classworlds.launcher.Launcher.main(Launcher.java:356)
      at org.codehaus.classworlds.Launcher.main(Launcher.java:47)
      [INFO] -------------------------------------------------------------
      [ERROR] COMPILATION ERROR :
      [INFO] -------------------------------------------------------------
      [ERROR] An unknown compilation problem occurred
      [INFO] 1 error
      [INFO] -------------------------------------------------------------
      [INFO] ------------------------------------------------------------------------
      [INFO] BUILD FAILURE
      [INFO] ------------------------------------------------------------------------
      [INFO] Total time: 2.415 s
      [INFO] Finished at: 2018-06-26T09:41:33+03:00
      [INFO] Final Memory: 23M/87M
      [INFO] ------------------------------------------------------------------------
      [ERROR] Failed to execute goal org.apache.maven.plugins:maven-compiler-plugin:3.7.0:compile (default-compile) on project sdn-frontend: Compilation failure
      [ERROR] An unknown compilation problem occurred
      [ERROR] -> [Help 1]
      [ERROR]
      [ERROR] To see the full stack trace of the errors, re-run Maven with the -e switch.
      [ERROR] Re-run Maven using the -X switch to enable full debug logging.
      [ERROR]
      [ERROR] For more information about the errors and possible solutions, please read the following articles:
      [ERROR] [Help 1] http://cwiki.apache.org/confluence/display/MAVEN/MojoFailureException

      Process finished with exit code 1


      FREQUENCY : always


        Attachments

          Issue Links

            Activity

              People

              Assignee:
              fmatte Fairoz Matte
              Reporter:
              webbuggrp Webbug Group
              Votes:
              0 Vote for this issue
              Watchers:
              2 Start watching this issue

                Dates

                Created:
                Updated:
                Resolved: