Uploaded image for project: 'JDK'
  1. JDK
  2. JDK-8206947

[Graal] compiler/graalunit/HotspotTest.java AssertionError: no profile

    XMLWordPrintable

    Details

    • Subcomponent:
    • CPU:
      generic
    • OS:
      generic

      Description

      2 Graal unit tests failed:

      There were 2 failures:
      1) testOSR04(org.graalvm.compiler.hotspot.test.GraalOSRTest)
      java.lang.AssertionError: no profile
      at org.graalvm.compiler.hotspot.test.GraalOSRTest.testFunnyOSR(GraalOSRTest.java:135)
      at org.graalvm.compiler.hotspot.test.GraalOSRTest.testOSR04(GraalOSRTest.java:109)

      2) testOSR05(org.graalvm.compiler.hotspot.test.GraalOSRTest)
      java.lang.AssertionError: no profile
      at org.graalvm.compiler.hotspot.test.GraalOSRTest.testFunnyOSR(GraalOSRTest.java:135)
      at org.graalvm.compiler.hotspot.test.GraalOSRTest.testOSR05(GraalOSRTest.java:114)

        Attachments

          Issue Links

            Activity

              People

              Assignee:
              epavlova Ekaterina Pavlova
              Reporter:
              kvn Vladimir Kozlov
              Votes:
              0 Vote for this issue
              Watchers:
              7 Start watching this issue

                Dates

                Created:
                Updated:
                Resolved: