Uploaded image for project: 'JDK'
  1. JDK
  2. JDK-8207013

[Graal] vmTestbase/nsk/jvmti/PopFrame tests fail with Graal

    Details

      Description

      Following popframe tests fail with Graal on macos and windows.

      - vmTestbase/nsk/jvmti/PopFrame/popframe001/TestDescription.java
      TEST FAILED: a tested frame has not been really popped

      - vmTestbase/nsk/jvmti/PopFrame/popframe003/TestDescription.java
      TEST FAILED: a tested frame has not been really popped

      - vmTestbase/nsk/jvmti/PopFrame/popframe005/TestDescription.java
      TEST FAILED: finally block was executed after popping
      TEST FAILED: the lockObj[0]'s monitor became free too early
      TEST FAILED: Lock acquired by a frame, different from the popped one,
      was released when the popped frame had been popped

        Attachments

          Issue Links

            Activity

              People

              • Assignee:
                amenkov Alex Menkov
                Reporter:
                epavlova Ekaterina Pavlova
              • Votes:
                0 Vote for this issue
                Watchers:
                5 Start watching this issue

                Dates

                • Created:
                  Updated: