Uploaded image for project: 'JDK'
  1. JDK
  2. JDK-8207244

java/nio/channels/Selector/SelectWithConsumer.java testInterruptDuringSelect() fails intermittently

    Details

    • Subcomponent:
    • Resolved In Build:
      b24
    • CPU:
      generic
    • OS:
      generic

      Backports

        Description

        The following test failed in the jdk11 CI:

        java/nio/channels/Selector/SelectWithConsumer.java

        Here's a snippet of the log file:

        ----------System.out:(68/4018)----------
        [TestNG] Running:
          java/nio/channels/Selector/SelectWithConsumer.java

        test SelectWithConsumer.testActionClosingSelector(): success
        test SelectWithConsumer.testCancel(): success
        test SelectWithConsumer.testCloseDuringSelect(): success
        test SelectWithConsumer.testClosedSelector1(): success
        test SelectWithConsumer.testClosedSelector2(): success
        test SelectWithConsumer.testClosedSelector3(): success
        test SelectWithConsumer.testInterruptBeforeSelect(): success
        test SelectWithConsumer.testInterruptDuringSelect(): failure
        java.lang.AssertionError: select took 5204 ms expected [true] but found [false]
        at org.testng.Assert.fail(Assert.java:94)
        at org.testng.Assert.failNotEquals(Assert.java:496)
        at org.testng.Assert.assertTrue(Assert.java:42)
        at SelectWithConsumer.testInterruptDuringSelect(SelectWithConsumer.java:414)
        at java.base/jdk.internal.reflect.NativeMethodAccessorImpl.invoke0(Native Method)
        at java.base/jdk.internal.reflect.NativeMethodAccessorImpl.invoke(NativeMethodAccessorImpl.java:62)
        at java.base/jdk.internal.reflect.DelegatingMethodAccessorImpl.invoke(DelegatingMethodAccessorImpl.java:43)
        at java.base/java.lang.reflect.Method.invoke(Method.java:566)
        at org.testng.internal.MethodInvocationHelper.invokeMethod(MethodInvocationHelper.java:85)
        at org.testng.internal.Invoker.invokeMethod(Invoker.java:639)
        at org.testng.internal.Invoker.invokeTestMethod(Invoker.java:821)
        at org.testng.internal.Invoker.invokeTestMethods(Invoker.java:1131)
        at org.testng.internal.TestMethodWorker.invokeTestMethods(TestMethodWorker.java:124)
        at org.testng.internal.TestMethodWorker.run(TestMethodWorker.java:108)
        at org.testng.TestRunner.privateRun(TestRunner.java:773)
        at org.testng.TestRunner.run(TestRunner.java:623)
        at org.testng.SuiteRunner.runTest(SuiteRunner.java:357)
        at org.testng.SuiteRunner.runSequentially(SuiteRunner.java:352)
        at org.testng.SuiteRunner.privateRun(SuiteRunner.java:310)
        at org.testng.SuiteRunner.run(SuiteRunner.java:259)
        at org.testng.SuiteRunnerWorker.runSuite(SuiteRunnerWorker.java:52)
        at org.testng.SuiteRunnerWorker.run(SuiteRunnerWorker.java:86)
        at org.testng.TestNG.runSuitesSequentially(TestNG.java:1185)
        at org.testng.TestNG.runSuitesLocally(TestNG.java:1110)
        at org.testng.TestNG.run(TestNG.java:1018)
        at com.sun.javatest.regtest.agent.TestNGRunner.main(TestNGRunner.java:94)
        at java.base/jdk.internal.reflect.NativeMethodAccessorImpl.invoke0(Native Method)
        at java.base/jdk.internal.reflect.NativeMethodAccessorImpl.invoke(NativeMethodAccessorImpl.java:62)
        at java.base/jdk.internal.reflect.DelegatingMethodAccessorImpl.invoke(DelegatingMethodAccessorImpl.java:43)
        at java.base/java.lang.reflect.Method.invoke(Method.java:566)
        at com.sun.javatest.regtest.agent.MainActionHelper$SameVMRunnable.run(MainActionHelper.java:229)
        at java.base/java.lang.Thread.run(Thread.java:834)
        test SelectWithConsumer.testLocks(): success
        test SelectWithConsumer.testNegativeTimeout(): success
        test SelectWithConsumer.testNull1(): success
        test SelectWithConsumer.testNull2(): success
        test SelectWithConsumer.testNull3(): success
        test SelectWithConsumer.testReadable(): success
        test SelectWithConsumer.testReadableAndWriteable(): success
        test SelectWithConsumer.testReentrantSelect1(): success
        test SelectWithConsumer.testReentrantSelect2(): success
        test SelectWithConsumer.testReentrantSelect3(): success
        test SelectWithConsumer.testRepeatedSelect1(): success
        test SelectWithConsumer.testRepeatedSelect2(): success
        test SelectWithConsumer.testTimeout(): success
        test SelectWithConsumer.testTwoChannels(): success
        test SelectWithConsumer.testWakeupBeforeSelect(): success
        test SelectWithConsumer.testWakeupDuringSelect(): success
        test SelectWithConsumer.testWritable(): success
        config SelectWithConsumer.shutdownThreadPool(): success

        ===============================================
        java/nio/channels/Selector/SelectWithConsumer.java
        Total tests run: 25, Failures: 1, Skips: 0
        ===============================================

        ----------System.err:(12/725)----------
        java.lang.Exception: failures: 1
        at com.sun.javatest.regtest.agent.TestNGRunner.main(TestNGRunner.java:96)
        at java.base/jdk.internal.reflect.NativeMethodAccessorImpl.invoke0(Native Method)
        at java.base/jdk.internal.reflect.NativeMethodAccessorImpl.invoke(NativeMethodAccessorImpl.java:62)
        at java.base/jdk.internal.reflect.DelegatingMethodAccessorImpl.invoke(DelegatingMethodAccessorImpl.java:43)
        at java.base/java.lang.reflect.Method.invoke(Method.java:566)
        at com.sun.javatest.regtest.agent.MainActionHelper$SameVMRunnable.run(MainActionHelper.java:229)
        at java.base/java.lang.Thread.run(Thread.java:834)

        JavaTest Message: Test threw exception: java.lang.Exception
        JavaTest Message: shutting down test

        result: Failed. Execution failed: `main' threw exception: java.lang.Exception: failures: 1


        test result: Failed. Execution failed: `main' threw exception: java.lang.Exception: failures: 1

          Attachments

            Issue Links

              Activity

                People

                • Assignee:
                  mli Hamlin Li
                  Reporter:
                  dcubed Daniel Daugherty
                • Votes:
                  0 Vote for this issue
                  Watchers:
                  6 Start watching this issue

                  Dates

                  • Created:
                    Updated:
                    Resolved: