Uploaded image for project: 'JDK'
  1. JDK
  2. JDK-8207757

compiler/graalunit/JttThreadsTest.java failed with java.lang.AssertionError: expected:<true> but was:<false>

    Details

      Description

      There was 1 failure:
      1) run0(org.graalvm.compiler.jtt.threads.Monitor_contended01)
      java.lang.AssertionError: expected:<true> but was:<false>
      at org.junit.Assert.fail(Assert.java:88)
      at org.junit.Assert.failNotEquals(Assert.java:834)
      at org.junit.Assert.assertEquals(Assert.java:118)
      at org.graalvm.compiler.test.GraalTest.assertDeepEquals(GraalTest.java:175)
      at org.graalvm.compiler.test.GraalTest.assertDeepEquals(GraalTest.java:126)
      at org.graalvm.compiler.test.GraalTest.assertDeepEquals(GraalTest.java:113)
      at org.graalvm.compiler.jtt.JTTTest.assertDeepEquals(JTTTest.java:85)
      at org.graalvm.compiler.core.test.GraalCompilerTest.assertEquals(GraalCompilerTest.java:883)
      at org.graalvm.compiler.core.test.GraalCompilerTest.testAgainstExpected(GraalCompilerTest.java:857)
      at org.graalvm.compiler.jtt.JTTTest.runTest(JTTTest.java:111)
      at org.graalvm.compiler.jtt.JTTTest.runTest(JTTTest.java:94)
      at org.graalvm.compiler.jtt.JTTTest.runTest(JTTTest.java:90)
      at org.graalvm.compiler.jtt.threads.Monitor_contended01.run0(Monitor_contended01.java:88)
      at java.base/jdk.internal.reflect.NativeMethodAccessorImpl.invoke0(Native Method)
      at java.base/jdk.internal.reflect.NativeMethodAccessorImpl.invoke(NativeMethodAccessorImpl.java:62)
      at java.base/jdk.internal.reflect.DelegatingMethodAccessorImpl.invoke(DelegatingMethodAccessorImpl.java:43)
      at java.base/java.lang.reflect.Method.invoke(Method.java:566)
      at org.junit.runners.model.FrameworkMethod$1.runReflectiveCall(FrameworkMethod.java:50)
      at org.junit.internal.runners.model.ReflectiveCallable.run(ReflectiveCallable.java:12)
      at org.junit.runners.model.FrameworkMethod.invokeExplosively(FrameworkMethod.java:47)
      at org.junit.internal.runners.statements.InvokeMethod.evaluate(InvokeMethod.java:17)
      at org.junit.internal.runners.statements.RunAfters.evaluate(RunAfters.java:27)
      at org.junit.internal.runners.statements.FailOnTimeout$CallableStatement.call(FailOnTimeout.java:298)
      at org.junit.internal.runners.statements.FailOnTimeout$CallableStatement.call(FailOnTimeout.java:292)
      at java.base/java.util.concurrent.FutureTask.run(FutureTask.java:264)
      at java.base/java.lang.Thread.run(Thread.java:834)

      FAILURES!!!
      Tests run: 67, Failures: 1

      ............
       exitValue = 1

      java.lang.RuntimeException: Expected to get exit value of [0]

      at jdk.test.lib.process.OutputAnalyzer.shouldHaveExitValue(OutputAnalyzer.java:396)
      at compiler.graalunit.common.GraalUnitTestLauncher.main(GraalUnitTestLauncher.java:264)
      at java.base/jdk.internal.reflect.NativeMethodAccessorImpl.invoke0(Native Method)
      at java.base/jdk.internal.reflect.NativeMethodAccessorImpl.invoke(NativeMethodAccessorImpl.java:62)
      at java.base/jdk.internal.reflect.DelegatingMethodAccessorImpl.invoke(DelegatingMethodAccessorImpl.java:43)
      at java.base/java.lang.reflect.Method.invoke(Method.java:566)
      at com.sun.javatest.regtest.agent.MainWrapper$MainThread.run(MainWrapper.java:115)
      at java.base/java.lang.Thread.run(Thread.java:834)

      JavaTest Message: Test threw exception: java.lang.RuntimeException: Expected to get exit value of [0]

      JavaTest Message: shutting down test

      STATUS:Failed.`main' threw exception: java.lang.RuntimeException: Expected to get exit value of [0]

        Attachments

          Activity

            People

            • Assignee:
              kvn Vladimir Kozlov
              Reporter:
              xyin Chris Yin
            • Votes:
              0 Vote for this issue
              Watchers:
              7 Start watching this issue

              Dates

              • Created:
                Updated: