Uploaded image for project: 'JDK'
  1. JDK
  2. JDK-8207908

JMXStatusTest.java fails intermittently on Solaris-X64

    Details

    • Type: Bug
    • Status: Open
    • Priority: P4
    • Resolution: Unresolved
    • Affects Version/s: 11
    • Fix Version/s: tbd
    • Component/s: core-svc
    • Labels:

      Description

      The following test failed on Solaris X64 in release and
      slowdebug configs using jdk11+19 bits:

      sun/management/jmxremote/startstop/JMXStatusTest.java

      The test did not fail in the fastdebug config at all and did not
      fail in all 'release' or 'slowdebug' runs so I'm tagging this bug
      as intermittent.

      Here's a snippet from the stdout part of one of the 'release'
      bits failures:

      test JMXStatusTest.testAgentDefault(): failure
      java.lang.AssertionError: expected [true] but found [false]
              at org.testng.Assert.fail(Assert.java:94)
              at org.testng.Assert.failNotEquals(Assert.java:496)
              at org.testng.Assert.assertTrue(Assert.java:42)
              at JMXStatusTest.assertStatusMatches(JMXStatusTest.java:155)
              at JMXStatusTest.assertStatusMatches(JMXStatusTest.java:148)
              at JMXStatusTest.testAgentDefault(JMXStatusTest.java:144)
              at java.base/jdk.internal.reflect.NativeMethodAccessorImpl.invoke0(Native Method)
              at java.base/jdk.internal.reflect.NativeMethodAccessorImpl.invoke(NativeMethodAccessorImpl.java:62)
              at java.base/jdk.internal.reflect.DelegatingMethodAccessorImpl.invoke(DelegatingMethodAccessorImpl.java:43)
              at java.base/java.lang.reflect.Method.invoke(Method.java:566)
              at org.testng.internal.MethodInvocationHelper.invokeMethod(MethodInvocationHelper.java:85)
              at org.testng.internal.Invoker.invokeMethod(Invoker.java:639)
              at org.testng.internal.Invoker.invokeTestMethod(Invoker.java:821)
              at org.testng.internal.Invoker.invokeTestMethods(Invoker.java:1131)
              at org.testng.internal.TestMethodWorker.invokeTestMethods(TestMethodWorker.java:124)
              at org.testng.internal.TestMethodWorker.run(TestMethodWorker.java:108)
              at org.testng.TestRunner.privateRun(TestRunner.java:773)
              at org.testng.TestRunner.run(TestRunner.java:623)
              at org.testng.SuiteRunner.runTest(SuiteRunner.java:357)
              at org.testng.SuiteRunner.runSequentially(SuiteRunner.java:352)
              at org.testng.SuiteRunner.privateRun(SuiteRunner.java:310)
              at org.testng.SuiteRunner.run(SuiteRunner.java:259)
              at org.testng.SuiteRunnerWorker.runSuite(SuiteRunnerWorker.java:52)
              at org.testng.SuiteRunnerWorker.run(SuiteRunnerWorker.java:86)
              at org.testng.TestNG.runSuitesSequentially(TestNG.java:1185)
              at org.testng.TestNG.runSuitesLocally(TestNG.java:1110)
              at org.testng.TestNG.run(TestNG.java:1018)
              at com.sun.javatest.regtest.agent.TestNGRunner.main(TestNGRunner.java:94)
              at com.sun.javatest.regtest.agent.TestNGRunner.main(TestNGRunner.java:54)
              at java.base/jdk.internal.reflect.NativeMethodAccessorImpl.invoke0(Native Method)
              at java.base/jdk.internal.reflect.NativeMethodAccessorImpl.invoke(NativeMethodAccessorImpl.java:62)
              at java.base/jdk.internal.reflect.DelegatingMethodAccessorImpl.invoke(DelegatingMethodAccessorImpl.java:43)
              at java.base/java.lang.reflect.Method.invoke(Method.java:566)
              at com.sun.javatest.regtest.agent.MainWrapper$MainThread.run(MainWrapper.java:115)
              at java.base/java.lang.Thread.run(Thread.java:832)
      [TestApp] read: 1
      [TestApp] main exit

      Here's the stderr part of the same log:

      ----------System.err:(15/936)----------
      [jcmd] java.lang.RuntimeException: Invalid agent state: Agent already started
      java.lang.Exception: failures: 1
              at com.sun.javatest.regtest.agent.TestNGRunner.main(TestNGRunner.java:96)
              at com.sun.javatest.regtest.agent.TestNGRunner.main(TestNGRunner.java:54)
              at java.base/jdk.internal.reflect.NativeMethodAccessorImpl.invoke0(Native Method)
              at java.base/jdk.internal.reflect.NativeMethodAccessorImpl.invoke(NativeMethodAccessorImpl.java:62)
              at java.base/jdk.internal.reflect.DelegatingMethodAccessorImpl.invoke(DelegatingMethodAccessorImpl.java:43)
              at java.base/java.lang.reflect.Method.invoke(Method.java:566)
              at com.sun.javatest.regtest.agent.MainWrapper$MainThread.run(MainWrapper.java:115)
              at java.base/java.lang.Thread.run(Thread.java:832)

      JavaTest Message: Test threw exception: java.lang.Exception: failures: 1
      JavaTest Message: shutting down test

      STATUS:Failed.`main' threw exception: java.lang.Exception: failures: 1


      The two 'release' bits logs are similar. The 'slowdebug' failures
      are more verbose.

        Attachments

          Issue Links

            Activity

              People

              • Assignee:
                Unassigned
                Reporter:
                dcubed Daniel Daugherty
              • Votes:
                0 Vote for this issue
                Watchers:
                1 Start watching this issue

                Dates

                • Created:
                  Updated: