Uploaded image for project: 'JDK'
  1. JDK
  2. JDK-8208569

[TEST_BUG] javax/swing/text/html/StyleSheet/bug4936917.java: Test failed

    Details

      Description

      ADDITIONAL SYSTEM INFORMATION :
      $ uname -a
      Darwin unit 17.7.0 Darwin Kernel Version 17.7.0: Thu Jun 21 22:53:14 PDT 2018; root:xnu-4570.71.2~1/RELEASE_X86_64 x86_64

      JDK under test: /Users/vprovodin/workspace/jdk/openjdk/openjdk-11-ea+23_osx-x64/Contents/Home
      openjdk version "11-ea" 2018-09-25
      OpenJDK Runtime Environment 18.9 (build 11-ea+23)
      OpenJDK 64-Bit Server VM 18.9 (build 11-ea+23, mixed mode)


      A DESCRIPTION OF THE PROBLEM :
      The test javax/swing/text/html/StyleSheet/bug4936917.java fails on MacOSX

      STEPS TO FOLLOW TO REPRODUCE THE PROBLEM :
      $ jtreg -ignore:quiet -v -a -xml -testjdk:"/Users/vprovodin/workspace/jdk/openjdk/openjdk-11-ea+23_osx-x64/Contents/Home/" -javaoptions:"-Djava.awt.headless=false" test/javax/swing/text/html/StyleSheet/bug4936917.java

      ACTUAL -
      #section:main
      ----------messages:(5/182)----------
      command: main bug4936917
      reason: User specified action: run main bug4936917
      Mode: othervm
      Additional options from @modules: --add-modules java.desktop
      elapsed time (seconds): 2.173
      ----------configuration:(3/40)----------
      Boot Layer
        add modules: java.desktop

      ----------System.out:(10/480)----------
      color (15,60)=java.awt.Color[r=193,g=193,b=193]
      color (16,60)=java.awt.Color[r=193,g=193,b=193]
      color (17,60)=java.awt.Color[r=193,g=193,b=193]
      color (18,60)=java.awt.Color[r=193,g=193,b=193]
      color (19,60)=java.awt.Color[r=193,g=193,b=193]
      color (20,60)=java.awt.Color[r=193,g=193,b=193]
      color (21,60)=java.awt.Color[r=193,g=193,b=193]
      color (22,60)=java.awt.Color[r=193,g=193,b=193]
      color (23,60)=java.awt.Color[r=193,g=193,b=193]
      color (24,60)=java.awt.Color[r=193,g=193,b=193]
      ----------System.err:(14/817)----------
      java.lang.RuntimeException: Test failed.
      at bug4936917.destroy(bug4936917.java:112)
      at bug4936917.main(bug4936917.java:120)
      at java.base/jdk.internal.reflect.NativeMethodAccessorImpl.invoke0(Native Method)
      at java.base/jdk.internal.reflect.NativeMethodAccessorImpl.invoke(NativeMethodAccessorImpl.java:62)
      at java.base/jdk.internal.reflect.DelegatingMethodAccessorImpl.invoke(DelegatingMethodAccessorImpl.java:43)
      at java.base/java.lang.reflect.Method.invoke(Method.java:566)
      at com.sun.javatest.regtest.agent.MainWrapper$MainThread.run(MainWrapper.java:115)
      at java.base/java.lang.Thread.run(Thread.java:834)

      JavaTest Message: Test threw exception: java.lang.RuntimeException: Test failed.
      JavaTest Message: shutting down test

      STATUS:Failed.`main' threw exception: java.lang.RuntimeException: Test failed.

      ---------- BEGIN SOURCE ----------
      http://hg.openjdk.java.net/jdk10/jdk10/jdk/file/777356696811/test/javax/swing/text/html/StyleSheet/bug4936917.java
      http://hg.openjdk.java.net/jdk/jdk11/file/17b7d7034e8e/test/jdk/javax/swing/text/html/StyleSheet/bug4936917.java
      ---------- END SOURCE ----------

      FREQUENCY : always


        Attachments

          Activity

            People

            • Assignee:
              trebari Tejpal Rebari
              Reporter:
              webbuggrp Webbug Group
            • Votes:
              0 Vote for this issue
              Watchers:
              4 Start watching this issue

              Dates

              • Created:
                Updated:
                Resolved: