Uploaded image for project: 'JDK'
  1. JDK
  2. JDK-8208605

Fix for 8199868 breaks tier1 build

    Details

    • Type: Bug
    • Status: Resolved
    • Priority: P1
    • Resolution: Fixed
    • Affects Version/s: 12
    • Fix Version/s: 12
    • Component/s: hotspot
    • Labels:
    • Subcomponent:
      gc
    • Resolved In Build:
      b06
    • CPU:
      sparc
    • OS:
      solaris

      Description

      jib > Creating support/test/hotspot/jtreg/native/bin/ThreadSignalMask from 1 file(s)
      jib > "/scratch/opt/mach5/mesos/work_dir/05f7edb3-16fa-4fcb-ac0e-4b60cd625534/workspace/open/test/hotspot/jtreg/gc/epsilon/libCriticalNative.c", line 85: error: declaration can not follow a statement (E_DECLARATION_IN_CODE)
      jib > "/scratch/opt/mach5/mesos/work_dir/05f7edb3-16fa-4fcb-ac0e-4b60cd625534/workspace/open/test/hotspot/jtreg/gc/epsilon/libCriticalNative.c", line 93: error: declaration can not follow a statement (E_DECLARATION_IN_CODE)
      jib > "/scratch/opt/mach5/mesos/work_dir/05f7edb3-16fa-4fcb-ac0e-4b60cd625534/workspace/open/test/hotspot/jtreg/gc/epsilon/libCriticalNative.c", line 100: error: declaration can not follow a statement (E_DECLARATION_IN_CODE)
      jib > cc: acomp failed for /scratch/opt/mach5/mesos/work_dir/05f7edb3-16fa-4fcb-ac0e-4b60cd625534/workspace/open/test/hotspot/jtreg/gc/epsilon/libCriticalNative.c
      jib > JtregNativeHotspot.gmk:1508: recipe for target '/scratch/opt/mach5/mesos/work_dir/05f7edb3-16fa-4fcb-ac0e-4b60cd625534/workspace/build/solaris-sparcv9/support/test/hotspot/jtreg/native/support/libCriticalNative/libCriticalNative.o' failed
      jib > make[3]: *** [/scratch/opt/mach5/mesos/work_dir/05f7edb3-16fa-4fcb-ac0e-4b60cd625534/workspace/build/solaris-sparcv9/support/test/hotspot/jtreg/native/support/libCriticalNative/libCriticalNative.o] Error 1
      jib > make[3]: *** Waiting for unfinished jobs....
      jib > make/Main.gmk:475: recipe for target 'build-test-hotspot-jtreg-native' failed
      jib > make[2]: *** [build-test-hotspot-jtreg-native] Error 1
      jib > make[2]: *** Waiting for unfinished jobs....
      jib >
      jib > ERROR: Build failed for target 'default (product-bundles test-bundles)' in configuration 'solaris-sparcv9' (exit code 2)
      jib > Stopping sjavac server
      jib >

        Attachments

          Issue Links

            Activity

              People

              • Assignee:
                dcubed Daniel Daugherty
                Reporter:
                dcubed Daniel Daugherty
              • Votes:
                0 Vote for this issue
                Watchers:
                3 Start watching this issue

                Dates

                • Created:
                  Updated:
                  Resolved: