Uploaded image for project: 'JDK'
  1. JDK
  2. JDK-8209452

VerifyCACerts.java failed with "At least one cacert test failed"

    XMLWordPrintable

    Details

      Backports

        Description

        The following test failed in the JDK12 CI:

        lib/security/cacerts/VerifyCACerts.java

        Here's a snippet of the log file:

        Exception: java.lang.Exception: At least one cacert test failed
        Exception: cert is expired

          Attachments

            Issue Links

              Activity

                People

                Assignee:
                rhalade Rajan Halade
                Reporter:
                dcubed Daniel Daugherty
                Votes:
                0 Vote for this issue
                Watchers:
                6 Start watching this issue

                  Dates

                  Created:
                  Updated:
                  Resolved: