Uploaded image for project: 'JDK'
  1. JDK
  2. JDK-8209537

Two security tests failed after JDK-8164639 due to dependency was missed

    Details

    • Resolved In Build:
      b27

      Backports

        Description

        - sun/security/tools/keytool/autotest.sh
        Exception in thread "main" java.security.ProviderException: Library /scratch/mesos/jib-master/install/jdk11-jdk.1179/src.full/open/test/jdk/sun/security/tools/keytool/../../pkcs11/nss/lib/macosx-x86_64/libsoftokn3.dylib does not exist

        - sun/security/ec/TestEC.java
        /scratch/opt/mach5/mesos/work_dir/jib-master/install/jdk11-jdk.1179/src.full/open/test/jdk/sun/security/pkcs11/PKCS11Test.java:56: error: package jdk.test.lib.artifacts does not exist
        import jdk.test.lib.artifacts.Artifact;
                                     ^
        /scratch/opt/mach5/mesos/work_dir/jib-master/install/jdk11-jdk.1179/src.full/open/test/jdk/sun/security/pkcs11/PKCS11Test.java:57: error: package jdk.test.lib.artifacts does not exist
        import jdk.test.lib.artifacts.ArtifactResolver;
                                     ^
        /scratch/opt/mach5/mesos/work_dir/jib-master/install/jdk11-jdk.1179/src.full/open/test/jdk/sun/security/pkcs11/PKCS11Test.java:58: error: package jdk.test.lib.artifacts does not exist
        import jdk.test.lib.artifacts.ArtifactResolverException;
                                     ^
        /scratch/opt/mach5/mesos/work_dir/jib-master/install/jdk11-jdk.1179/src.full/open/test/jdk/sun/security/pkcs11/PKCS11Test.java:886: error: cannot find symbol
            @Artifact(
             ^
          symbol: class Artifact
          location: class PKCS11Test
        /scratch/opt/mach5/mesos/work_dir/jib-master/install/jdk11-jdk.1179/src.full/open/test/jdk/sun/security/pkcs11/PKCS11Test.java:893: error: cannot find symbol
            @Artifact(
             ^
          symbol: class Artifact
          location: class PKCS11Test
        /scratch/opt/mach5/mesos/work_dir/jib-master/install/jdk11-jdk.1179/src.full/open/test/jdk/sun/security/pkcs11/PKCS11Test.java:900: error: cannot find symbol
            @Artifact(
             ^
          symbol: class Artifact
          location: class PKCS11Test
        /scratch/opt/mach5/mesos/work_dir/jib-master/install/jdk11-jdk.1179/src.full/open/test/jdk/sun/security/pkcs11/PKCS11Test.java:870: error: cannot find symbol
                    path = ArtifactResolver.resolve(clazz).entrySet().stream()
                           ^
          symbol: variable ArtifactResolver
          location: class PKCS11Test
        /scratch/opt/mach5/mesos/work_dir/jib-master/install/jdk11-jdk.1179/src.full/open/test/jdk/sun/security/pkcs11/PKCS11Test.java:873: error: cannot find symbol
                } catch (ArtifactResolverException e) {
                         ^
          symbol: class ArtifactResolverException
          location: class PKCS11Test

          Attachments

            Issue Links

              Activity

                People

                • Assignee:
                  jjiang John Jiang
                  Reporter:
                  jjiang John Jiang
                • Votes:
                  0 Vote for this issue
                  Watchers:
                  2 Start watching this issue

                  Dates

                  • Created:
                    Updated:
                    Resolved: