Uploaded image for project: 'JDK'
  1. JDK
  2. JDK-8212153

RedefineClasses/StressRedefine/TestDescription.java with exit code 134 on Linux-X64

    XMLWordPrintable

    Details

    • Type: Bug
    • Status: Closed
    • Priority: P4
    • Resolution: Duplicate
    • Affects Version/s: 10
    • Fix Version/s: None
    • Component/s: hotspot
    • Labels:
    • Subcomponent:
    • CPU:
      x86_64
    • OS:
      linux_ubuntu

      Description

      The following test failed due to an AssertionError on Linux X64
      in the fastdebug config using jdk-12+14 bits:

      vmTestbase/nsk/jvmti/RedefineClasses/StressRedefine/TestDescription.java

      The test only failed in 1 of 3 'fastdebug' bits runs so I'm
      tagging this bug as intermittent. It did not fail at all in the
      'slowdebug' or 'release' bits runs.

      Here is a snippet from the log file:

      <<<<<<<< RedefineClasses() is successfully done
      >>>>>>>> Invoke RedefineClasses():
              new class byte count=2283
      Current thread is 15937
      Dumping core ...
      ----------System.err:(13/3662)----------
      java.lang.AssertionError: [/work/shared/bug_hunt/thread_SMR_stress/jdk12_exp/build/linux-x86_64-normal-server-fastdebug/images/jdk/bin/java, -XX:MaxRAMPercentage=1, -cp, /work/shared/bug_hunt/thread_SMR_stress/jdk12_exp/build/linux-x86_64-normal-server-fastdebug/test-support/jtreg_open_test_hotspot_jtreg_vmTestbase_nsk_jvmti/classes/14/vmTestbase/nsk/jvmti/RedefineClasses/StressRedefine/TestDescription.d:/work/shared/bug_hunt/thread_SMR_stress/jdk12_exp/build/linux-x86_64-normal-server-fastdebug/test-support/jtreg_open_test_hotspot_jtreg_vmTestbase_nsk_jvmti/classes/14/vmTestbase:/work/shared/bug_hunt/thread_SMR_stress/jdk12_exp/build/linux-x86_64-normal-server-fastdebug/test-support/jtreg_open_test_hotspot_jtreg_vmTestbase_nsk_jvmti/classes/14/test/lib, -Djava.library.path=/work/shared/bug_hunt/thread_SMR_stress/jdk12_exp/build/linux-x86_64-normal-server-fastdebug/images/test/hotspot/jtreg/native, -agentlib:stressRedefine, nsk.jvmti.RedefineClasses.StressRedefine, ./bin] exit code is 134
              at ExecDriver.main(ExecDriver.java:139)
              at java.base/jdk.internal.reflect.NativeMethodAccessorImpl.invoke0(Native Method)
              at java.base/jdk.internal.reflect.NativeMethodAccessorImpl.invoke(NativeMethodAccessorImpl.java:62)
              at java.base/jdk.internal.reflect.DelegatingMethodAccessorImpl.invoke(DelegatingMethodAccessorImpl.java:43)
              at java.base/java.lang.reflect.Method.invoke(Method.java:566)
              at com.sun.javatest.regtest.agent.MainWrapper$MainThread.run(MainWrapper.java:127)
              at java.base/java.lang.Thread.run(Thread.java:835)

      JavaTest Message: Test threw exception: java.lang.AssertionError: [/work/shared/bug_hunt/thread_SMR_stress/jdk12_exp/build/linux-x86_64-normal-server-fastdebug/images/jdk/bin/java, -XX:MaxRAMPercentage=1, -cp, /work/shared/bug_hunt/thread_SMR_stress/jdk12_exp/build/linux-x86_64-normal-server-fastdebug/test-support/jtreg_open_test_hotspot_jtreg_vmTestbase_nsk_jvmti/classes/14/vmTestbase/nsk/jvmti/RedefineClasses/StressRedefine/TestDescription.d:/work/shared/bug_hunt/thread_SMR_stress/jdk12_exp/build/linux-x86_64-normal-server-fastdebug/test-support/jtreg_open_test_hotspot_jtreg_vmTestbase_nsk_jvmti/classes/14/vmTestbase:/work/shared/bug_hunt/thread_SMR_stress/jdk12_exp/build/linux-x86_64-normal-server-fastdebug/test-support/jtreg_open_test_hotspot_jtreg_vmTestbase_nsk_jvmti/classes/14/test/lib, -Djava.library.path=/work/shared/bug_hunt/thread_SMR_stress/jdk12_exp/build/linux-x86_64-normal-server-fastdebug/images/test/hotspot/jtreg/native, -agentlib:stressRedefine, nsk.jvmti.RedefineClasses.StressRedefine, ./bin] exit code is 134
      JavaTest Message: shutting down test

      STATUS:Failed.`main' threw exception: java.lang.AssertionError: [/work/shared/bug_hunt/thread_SMR_stress/jdk12_exp/build/linux-x86_64-normal-server-fastdebug/images/jdk/bin/java, -XX:MaxRAMPercentage=1, -cp, /work/shared/bug_hunt/thread_SMR_stress/jdk12_exp/build/linux-x86_64-normal-server-fastdebug/test-support/jtreg_open_test_hotspot_jtreg_vmTestbase_nsk_jvmti/classes/14/vmTestbase/nsk/jvmti/RedefineClasses/StressRedefine/TestDescription.d:/work/shared/bug_hunt/thread_SMR_stress/jdk12_exp/build/linux-x86_64-normal-server-fastdebug/test-support/jtreg_open_test_hotspot_jtreg_vmTestbase_nsk_jvmti/classes/14/vmTestbase:/work/shared/bug_hunt/thread_SMR_stress/jdk12_exp/build/linux-x86_64-normal-server-fastdebug/test-support/jtreg_open_test_hotspot_jtreg_vmTestbase_nsk_jvmti/classes/14/test/lib, -Djava.library.path=/work/shared/bug_hunt/thread_SMR_stress/jdk12_exp/build/linux-x86_64-normal-server-fastdebug/images/test/hotspot/jtreg/native, -agentlib:stressRedefine, nsk.jvmti.RedefineClasses.StressRedefine, ./bin] exit code is 134
      ----------rerun:(29/4459)*----------

      There's no indication of an hs_err_pid file being generated.

        Attachments

          Issue Links

            Activity

              People

              Assignee:
              Unassigned Unassigned
              Reporter:
              dcubed Daniel Daugherty
              Votes:
              0 Vote for this issue
              Watchers:
              2 Start watching this issue

                Dates

                Created:
                Updated:
                Resolved: