Uploaded image for project: 'JDK'
  1. JDK
  2. JDK-8212803

javax/net/ssl/DTLSv10/ tests failed with Too much loops for handshaking

    XMLWordPrintable

    Details

      Description

      Test Exception for SSL_RSA_WITH_3DES_EDE_CBC_SHA
      java.lang.Error: Too much loops for handshaking
      at SSLEngineTestCase.doHandshake(SSLEngineTestCase.java:593)
      at SSLEngineTestCase.doHandshake(SSLEngineTestCase.java:531)
      at EnginesClosureTest.closingTest(EnginesClosureTest.java:55)
      at EnginesClosureTest.testOneCipher(EnginesClosureTest.java:42)
      at SSLEngineTestCase.testSomeCiphers(SSLEngineTestCase.java:931)
      at SSLEngineTestCase.runTests(SSLEngineTestCase.java:720)
      at SSLEngineTestCase.runTests(SSLEngineTestCase.java:739)
      at EnginesClosureTest.main(EnginesClosureTest.java:36)
      at DTLSv10EnginesClosureTest.main(DTLSv10EnginesClosureTest.java:52)
      at java.base/jdk.internal.reflect.NativeMethodAccessorImpl.invoke0(Native Method)
      at java.base/jdk.internal.reflect.NativeMethodAccessorImpl.invoke(NativeMethodAccessorImpl.java:62)
      at java.base/jdk.internal.reflect.DelegatingMethodAccessorImpl.invoke(DelegatingMethodAccessorImpl.java:43)
      at java.base/java.lang.reflect.Method.invoke(Method.java:566)
      at com.sun.javatest.regtest.agent.MainWrapper$MainThread.run(MainWrapper.java:127)
      at java.base/java.lang.Thread.run(Thread.java:835)
      java.lang.AssertionError: 1 of 38 tests failed!
      at SSLEngineTestCase.runTests(SSLEngineTestCase.java:722)
      at SSLEngineTestCase.runTests(SSLEngineTestCase.java:739)
      at EnginesClosureTest.main(EnginesClosureTest.java:36)
      at DTLSv10EnginesClosureTest.main(DTLSv10EnginesClosureTest.java:52)
      at java.base/jdk.internal.reflect.NativeMethodAccessorImpl.invoke0(Native Method)
      at java.base/jdk.internal.reflect.NativeMethodAccessorImpl.invoke(NativeMethodAccessorImpl.java:62)
      at java.base/jdk.internal.reflect.DelegatingMethodAccessorImpl.invoke(DelegatingMethodAccessorImpl.java:43)
      at java.base/java.lang.reflect.Method.invoke(Method.java:566)
      at com.sun.javatest.regtest.agent.MainWrapper$MainThread.run(MainWrapper.java:127)
      at java.base/java.lang.Thread.run(Thread.java:835)

      JavaTest Message: Test threw exception: java.lang.AssertionError: 1 of 38 tests failed!
      JavaTest Message: shutting down test

      STATUS:Failed.`main' threw exception: java.lang.AssertionError: 1 of 38 tests failed!

      The following tests reproduce the intermittent failure:
      javax/net/ssl/DTLSv10/DTLSv10EnginesClosureTest.java
      javax/net/ssl/DTLSv10/DTLSv10MFLNTest.java

        Attachments

          Issue Links

            Activity

              People

              Assignee:
              rhalade Rajan Halade
              Reporter:
              qianqli Lily Li (Inactive)
              Votes:
              0 Vote for this issue
              Watchers:
              5 Start watching this issue

                Dates

                Created:
                Updated: