Uploaded image for project: 'JDK'
  1. JDK
  2. JDK-8214152

Kitchensink fails with several "No aspect with given name"

    Details

    • Type: Bug
    • Status: Closed
    • Priority: P4
    • Resolution: Duplicate
    • Affects Version/s: 12
    • Fix Version/s: None
    • Component/s: hotspot
    • Labels:
    • Subcomponent:
    • CPU:
      x86_64
    • OS:
      linux

      Description

      The following test failed in the jdk/jdk CI:

      applications/kitchensink/Kitchensink.java

      Here's a snippet from the log file:

      [glue.process.err] [analyzer.process.err] Starting the ResultAnalyzer
      [glue.process.err] [analyzer.process.err] FAILURE: SPECjbb2005.Max Transactions: No aspect with given name
      [glue.process.err] [analyzer.process.err] FAILURE: SPECjbb2005.Thread Spread: No aspect with given name
      [glue.process.err] [analyzer.process.err] FAILURE: SPECjbb2005.Min transactions: No aspect with given name
      [glue.process.err] [analyzer.process.err] FAILURE: SPECjbb2005.Throughput: No aspect with given name
      [glue.process.err] [analyzer.process.err] FAILURE: SPECjbb2005.Throughput: No aspect with given name
      [glue.process.err] [analyzer.process.err] FAILED: The kitchensink run failed.
      [glue.process.err] [Tue Nov 20 12:31:23 PST 2018] (1542745883443) Analyzer process has been shutdown
      [glue.process.err] [Tue Nov 20 12:31:23 PST 2018] (1542745883443) kitchensink: Finished
      Finished run at: Tue Nov 20 12:31:23 PST 2018
      result: Failed. Execution failed: `main' threw exception: java.lang.Error: Kitchensink failed with exit code = 1


      test result: Failed. Execution failed: `main' threw exception: java.lang.Error: Kitchensink failed with exit code = 1

        Attachments

          Issue Links

            Activity

              People

              • Assignee:
                Unassigned
                Reporter:
                dcubed Daniel Daugherty
              • Votes:
                0 Vote for this issue
                Watchers:
                2 Start watching this issue

                Dates

                • Created:
                  Updated:
                  Resolved: