Uploaded image for project: 'JDK'
  1. JDK
  2. JDK-8214721

sctp tests intermittent connection failures

    Details

    • Type: Bug
    • Status: Open
    • Priority: P4
    • Resolution: Unresolved
    • Affects Version/s: None
    • Fix Version/s: tbd
    • Component/s: core-libs
    • Labels:
      None
    • Subcomponent:
    • CPU:
      x86_64, sparc_64
    • OS:
      solaris_11

      Description

      We are seeing lots of intermittent sctp connection issues while executing jdk test on both X86 and sparc system running solaris (st_035)
      examples of connecting issues include the following

      com/sun/nio/sctp/SctpChannel/Bind.java


      ----------System.err:(55/3628)----------
      java.net.ConnectException: Connection refused
              at jdk.sctp/sun.nio.ch.sctp.SctpNet.connect0(Native Method)
              at jdk.sctp/sun.nio.ch.sctp.SctpNet.connect(SctpNet.java:68)
              at jdk.sctp/sun.nio.ch.sctp.SctpChannelImpl.connect(SctpChannelImpl.java:378)
              at Bind.connectChannel(Bind.java:289)
              at Bind.testBind(Bind.java:113)
              at Bind.test(Bind.java:64)
              at Bind.instanceMain(Bind.java:346)
              at java.base/jdk.internal.reflect.NativeMethodAccessorImpl.invoke0(Native Method)
              at java.base/jdk.internal.reflect.NativeMethodAccessorImpl.invoke(NativeMethodAccessorImpl.java:62)
              at java.base/jdk.internal.reflect.DelegatingMethodAccessorImpl.invoke(DelegatingMethodAccessorImpl.java:43)
              at java.base/java.lang.reflect.Method.invoke(Method.java:566)
              at Bind.main(Bind.java:343)
              at java.base/jdk.internal.reflect.NativeMethodAccessorImpl.invoke0(Native Method)
              at java.base/jdk.internal.reflect.NativeMethodAccessorImpl.invoke(NativeMethodAccessorImpl.java:62)
              at java.base/jdk.internal.reflect.DelegatingMethodAccessorImpl.invoke(DelegatingMethodAccessorImpl.java:43)
              at java.base/java.lang.reflect.Method.invoke(Method.java:566)
              at com.sun.javatest.regtest.agent.MainActionHelper$Sam
      java.net.ConnectException: Connection refused
              at jdk.sctp/sun.nio.ch.sctp.SctpNet.connect0(Native Method)
              at jdk.sctp/sun.nio.ch.sctp.SctpNet.connect(SctpNet.java:68)
              at jdk.sctp/sun.nio.ch.sctp.SctpChannelImpl.connect(SctpChannelImpl.java:378)
              at Bind.connectChannel(Bind.java:289)
              at Bind.testBind(Bind.java:113)
              at Bind.test(Bind.java:64)
              at Bind.instanceMain(Bind.java:346)
              at java.base/jdk.internal.reflect.NativeMethodAccessorImpl.invoke0(Native Method)
              at java.base/jdk.internal.reflect.NativeMethodAccessorImpl.invoke(NativeMethodAccessorImpl.java:62)
              at java.base/jdk.internal.reflect.DelegatingMethodAccessorImpl.invoke(DelegatingMethodAccessorImpl.java:43)
              at java.base/java.lang.reflect.Method.invoke(Method.java:566)
              at Bind.main(Bind.java:343)
              at java.base/jdk.internal.reflect.NativeMethodAccessorImpl.invoke0(Native Method)
              at java.base/jdk.internal.reflect.NativeMethodAccessorImpl.invoke(NativeMethodAccessorImpl.java:62)
              at java.base/jdk.internal.reflect.DelegatingMethodAccessorImpl.invoke(DelegatingMethodAccessorImpl.java:43)
              at java.base/java.lang.reflect.Method.invoke(Method.java:566)
              at com.sun.javatest.regtest.agent.MainActionHelper$SameVMRunnable.run(MainActionHelper.java:229)
              at java.base/java.lang.Thread.run(Thread.java:834)
      java.lang.AssertionError: Some tests failed
              at Bind.instanceMain(Bind.java:348)
              at java.base/jdk.internal.reflect.NativeMethodAccessorImpl.invoke0(Native Method)
              at java.base/jdk.internal.reflect.NativeMethodAccessorImpl.invoke(NativeMethodAccessorImpl.java:62)
              at java.base/jdk.internal.reflect.DelegatingMethodAccessorImpl.invoke(DelegatingMethodAccessorImpl.java:43)
              at java.base/java.lang.reflect.Method.invoke(Method.java:566)
              at Bind.main(Bind.java:343)
              at java.base/jdk.internal.reflect.NativeMethodAccessorImpl.invoke0(Native Method)
              at java.base/jdk.internal.reflect.NativeMethodAccessorImpl.invoke(NativeMethodAccessorImpl.java:62)
              at java.base/jdk.internal.reflect.DelegatingMethodAccessorImpl.invoke(DelegatingMethodAccessorImpl.java:43)
              at java.base/java.lang.reflect.Method.invoke(Method.java:566)
              at com.sun.javatest.regtest.agent.MainActionHelper$SameVMRunnable.run(MainActionHelper.java:229)
              at java.base/java.lang.Thread.run(Thread.java:834)

      JavaTest Message: Test threw exception: java.lang.AssertionError

        Attachments

          Activity

            People

            • Assignee:
              chegar Chris Hegarty
              Reporter:
              ckavanagh Colin Kavanagh
            • Votes:
              0 Vote for this issue
              Watchers:
              1 Start watching this issue

              Dates

              • Created:
                Updated: