Uploaded image for project: 'JDK'
  1. JDK
  2. JDK-8216181

[AOT] SA tests fail when AOT is enabled

    Details

      Description

      SA tests failed when AOT is enabled complaining about
      Exception: sun.jvm.hotspot.debugger.UnalignedAddressException: eaf6a3ad
      Exception: sun.jvm.hotspot.debugger.UnmappedAddressException: ...f6176616a4c1000
      Exception: java.lang.RuntimeException: Stderr has output other than VM warnings
      Exception: java.lang.NullPointerException

      List of affected tests:
      serviceability/sa/TestJhsdbJstackMixed.java
      serviceability/sa/TestJhsdbJstackLock.java
      serviceability/sa/JhsdbThreadInfoTest.java
      serviceability/sa/ClhsdbWhere.java
      serviceability/sa/ClhsdbThread.java
      serviceability/sa/ClhsdbSource.java
      serviceability/sa/ClhsdbPrintAs.java
      serviceability/sa/ClhsdbJstack.java
      serviceability/sa/ClhsdbJdis.java
      serviceability/sa/ClhsdbInspect.java

        Attachments

          Issue Links

            Activity

              People

              • Assignee:
                iveresov Igor Veresov
                Reporter:
                lmesnik Leonid Mesnik
              • Votes:
                0 Vote for this issue
                Watchers:
                12 Start watching this issue

                Dates

                • Created:
                  Updated: