Uploaded image for project: 'JDK'
  1. JDK
  2. JDK-8217882

java/net/httpclient/MaxStreams.java failed once

    XMLWordPrintable

    Details

    • Subcomponent:
    • Resolved In Build:
      b06

      Backports

        Description

        ----------System.out:(55/4638)----------
        [TestNG] Running:
          java/net/httpclient/MaxStreams.java

        config MaxStreams.setup(): success
        test MaxStreams.testAsString("http://localhost:59753/http2/fixed"): success
        test MaxStreams.testAsString("https://localhost:54210/http2/fixed"): failure
        org.testng.internal.thread.ThreadTimeoutException: Method org.testng.internal.TestNGMethod.testAsString() didn't finish within the time-out 20000
        at app//org.testng.internal.InvokeMethodRunnable.runOne(InvokeMethodRunnable.java:69)
        at app//org.testng.internal.InvokeMethodRunnable.run(InvokeMethodRunnable.java:44)
        at java.base@13-internal/java.util.concurrent.Executors$RunnableAdapter.call(Executors.java:515)
        at java.base@13-internal/java.util.concurrent.FutureTask.run(FutureTask.java:264)
        at java.base@13-internal/java.util.concurrent.ThreadPoolExecutor.runWorker(ThreadPoolExecutor.java:1128)
        at java.base@13-internal/java.util.concurrent.ThreadPoolExecutor$Worker.run(ThreadPoolExecutor.java:628)
        at java.base@13-internal/java.lang.Thread.run(Thread.java:835)
        test MaxStreams.testAsString("http://localhost:59753/http2/fixed"): failure
        org.testng.internal.thread.ThreadTimeoutException: Method org.testng.internal.TestNGMethod.testAsString() didn't finish within the time-out 20000
        at java.base@13-internal/java.util.concurrent.locks.AbstractQueuedSynchronizer$Node.compareAndSetNext(AbstractQueuedSynchronizer.java:538)
        at java.base@13-internal/java.util.concurrent.locks.AbstractQueuedSynchronizer.cancelAcquire(AbstractQueuedSynchronizer.java:815)
        at java.base@13-internal/java.util.concurrent.locks.AbstractQueuedSynchronizer.doAcquireSharedInterruptibly(AbstractQueuedSynchronizer.java:1043)
        at java.base@13-internal/java.util.concurrent.locks.AbstractQueuedSynchronizer.acquireSharedInterruptibly(AbstractQueuedSynchronizer.java:1345)
        at java.base@13-internal/java.util.concurrent.Semaphore.acquire(Semaphore.java:318)
        at app//MaxStreams.testAsString(MaxStreams.java:108)
        at java.base@13-internal/jdk.internal.reflect.NativeMethodAccessorImpl.invoke0(Native Method)
        at java.base@13-internal/jdk.internal.reflect.NativeMethodAccessorImpl.invoke(NativeMethodAccessorImpl.java:62)
        at java.base@13-internal/jdk.internal.reflect.DelegatingMethodAccessorImpl.invoke(DelegatingMethodAccessorImpl.java:43)
        at java.base@13-internal/java.lang.reflect.Method.invoke(Method.java:567)
        at app//org.testng.internal.MethodInvocationHelper.invokeMethod(MethodInvocationHelper.java:85)
        at app//org.testng.internal.InvokeMethodRunnable.runOne(InvokeMethodRunnable.java:54)
        at app//org.testng.internal.InvokeMethodRunnable.run(InvokeMethodRunnable.java:44)
        at java.base@13-internal/java.util.concurrent.Executors$RunnableAdapter.call(Executors.java:515)
        at java.base@13-internal/java.util.concurrent.FutureTask.run(FutureTask.java:264)
        at java.base@13-internal/java.util.concurrent.ThreadPoolExecutor.runWorker(ThreadPoolExecutor.java:1128)
        at java.base@13-internal/java.util.concurrent.ThreadPoolExecutor$Worker.run(ThreadPoolExecutor.java:628)
        at java.base@13-internal/java.lang.Thread.run(Thread.java:835)
        test MaxStreams.testAsString("https://localhost:54210/http2/fixed"): failure
        org.testng.internal.thread.ThreadTimeoutException: Method org.testng.internal.TestNGMethod.testAsString() didn't finish within the time-out 20000
        at java.base@13-internal/jdk.internal.reflect.NativeMethodAccessorImpl.invoke0(Native Method)
        at java.base@13-internal/jdk.internal.reflect.NativeMethodAccessorImpl.invoke(NativeMethodAccessorImpl.java:62)
        at java.base@13-internal/jdk.internal.reflect.DelegatingMethodAccessorImpl.invoke(DelegatingMethodAccessorImpl.java:43)
        at java.base@13-internal/java.lang.reflect.Method.invoke(Method.java:567)
        at app//org.testng.internal.MethodInvocationHelper.invokeMethod(MethodInvocationHelper.java:85)
        at app//org.testng.internal.InvokeMethodRunnable.runOne(InvokeMethodRunnable.java:54)
        at app//org.testng.internal.InvokeMethodRunnable.run(InvokeMethodRunnable.java:44)
        at java.base@13-internal/java.util.concurrent.Executors$RunnableAdapter.call(Executors.java:515)
        at java.base@13-internal/java.util.concurrent.FutureTask.run(FutureTask.java:264)
        at java.base@13-internal/java.util.concurrent.ThreadPoolExecutor.runWorker(ThreadPoolExecutor.java:1128)
        at java.base@13-internal/java.util.concurrent.ThreadPoolExecutor$Worker.run(ThreadPoolExecutor.java:628)
        at java.base@13-internal/java.lang.Thread.run(Thread.java:835)
        config MaxStreams.teardown(): success

        ===============================================
        java/net/httpclient/MaxStreams.java
        Total tests run: 4, Failures: 3, Skips: 0
        ===============================================

          Attachments

            Issue Links

              Activity

                People

                Assignee:
                dfuchs Daniel Fuchs
                Reporter:
                dfuchs Daniel Fuchs
                Votes:
                0 Vote for this issue
                Watchers:
                3 Start watching this issue

                  Dates

                  Created:
                  Updated:
                  Resolved: