Details

    • Type: Bug
    • Status: Closed
    • Priority: P4
    • Resolution: Duplicate
    • Affects Version/s: 8u171
    • Fix Version/s: None
    • Component/s: tools
    • Subcomponent:
    • CPU:
      x86_64
    • OS:
      generic

      Description

      A DESCRIPTION OF THE PROBLEM :
      An exception has occurred in the compiler (1.8.0_171). Please file a bug against the Java compiler via the Java bug reporting page (http://bugreport.java.com) after checking the Bug Database (http://bugs.java.com) for duplicates. Include your program and the following diagnostic in your report. Thank you.
      java.lang.NullPointerException
      at com.sun.tools.javac.comp.Check$1AnnotationValidator.visitAnnotation(Check.java:2657)
      at com.sun.tools.javac.tree.JCTree$JCAnnotation.accept(JCTree.java:2317)
      at com.sun.tools.javac.tree.TreeScanner.scan(TreeScanner.java:49)
      at com.sun.tools.javac.tree.TreeScanner.scan(TreeScanner.java:57)
      at com.sun.tools.javac.tree.TreeScanner.visitNewArray(TreeScanner.java:217)
      at com.sun.tools.javac.tree.JCTree$JCNewArray.accept(JCTree.java:1562)
      at com.sun.tools.javac.tree.TreeScanner.scan(TreeScanner.java:49)
      at com.sun.tools.javac.tree.TreeScanner.scan(TreeScanner.java:57)
      at com.sun.tools.javac.tree.TreeScanner.visitAnnotation(TreeScanner.java:320)
      at com.sun.tools.javac.comp.Check$1AnnotationValidator.visitAnnotation(Check.java:2658)
      at com.sun.tools.javac.tree.JCTree$JCAnnotation.accept(JCTree.java:2317)
      at com.sun.tools.javac.comp.Check.validateAnnotationTree(Check.java:2663)
      at com.sun.tools.javac.comp.Check.validateAnnotation(Check.java:2730)
      at com.sun.tools.javac.comp.Check.validateAnnotations(Check.java:2717)
      at com.sun.tools.javac.comp.MemberEnter$6.run(MemberEnter.java:891)
      at com.sun.tools.javac.comp.Annotate.flush(Annotate.java:155)
      at com.sun.tools.javac.comp.Annotate.enterDone(Annotate.java:129)
      at com.sun.tools.javac.comp.Enter.complete(Enter.java:512)
      at com.sun.tools.javac.comp.Enter.main(Enter.java:471)
      at com.sun.tools.javac.main.JavaCompiler.enterTrees(JavaCompiler.java:982)
      at com.sun.tools.javac.main.JavaCompiler.compile(JavaCompiler.java:857)
      at com.sun.tools.javac.main.Main.compile(Main.java:523)
      at com.sun.tools.javac.api.JavacTaskImpl.doCall(JavacTaskImpl.java:129)
      at com.sun.tools.javac.api.JavacTaskImpl.call(JavacTaskImpl.java:138)
      at org.codehaus.plexus.compiler.javac.JavaxToolsCompiler.compileInProcess(JavaxToolsCompiler.java:126)
      at org.codehaus.plexus.compiler.javac.JavacCompiler.performCompile(JavacCompiler.java:174)
      at org.apache.maven.plugin.compiler.AbstractCompilerMojo.execute(AbstractCompilerMojo.java:1129)
      at org.apache.maven.plugin.compiler.CompilerMojo.execute(CompilerMojo.java:188)
      at org.apache.maven.plugin.DefaultBuildPluginManager.executeMojo(DefaultBuildPluginManager.java:134)
      at org.apache.maven.lifecycle.internal.MojoExecutor.execute(MojoExecutor.java:207)
      at org.apache.maven.lifecycle.internal.MojoExecutor.execute(MojoExecutor.java:153)
      at org.apache.maven.lifecycle.internal.MojoExecutor.execute(MojoExecutor.java:145)
      at org.apache.maven.lifecycle.internal.LifecycleModuleBuilder.buildProject(LifecycleModuleBuilder.java:116)
      at org.apache.maven.lifecycle.internal.LifecycleModuleBuilder.buildProject(LifecycleModuleBuilder.java:80)
      at org.apache.maven.lifecycle.internal.builder.singlethreaded.SingleThreadedBuilder.build(SingleThreadedBuilder.java:51)
      at org.apache.maven.lifecycle.internal.LifecycleStarter.execute(LifecycleStarter.java:128)
      at org.apache.maven.DefaultMaven.doExecute(DefaultMaven.java:307)
      at org.apache.maven.DefaultMaven.doExecute(DefaultMaven.java:193)
      at org.apache.maven.DefaultMaven.execute(DefaultMaven.java:106)
      at org.apache.maven.cli.MavenCli.execute(MavenCli.java:863)
      at org.apache.maven.cli.MavenCli.doMain(MavenCli.java:288)
      at org.apache.maven.cli.MavenCli.main(MavenCli.java:199)
      at sun.reflect.NativeMethodAccessorImpl.invoke0(Native Method)
      at sun.reflect.NativeMethodAccessorImpl.invoke(NativeMethodAccessorImpl.java:62)
      at sun.reflect.DelegatingMethodAccessorImpl.invoke(DelegatingMethodAccessorImpl.java:43)
      at java.lang.reflect.Method.invoke(Method.java:498)
      at org.codehaus.plexus.classworlds.launcher.Launcher.launchEnhanced(Launcher.java:289)
      at org.codehaus.plexus.classworlds.launcher.Launcher.launch(Launcher.java:229)
      at org.codehaus.plexus.classworlds.launcher.Launcher.mainWithExitCode(Launcher.java:415)
      at org.codehaus.plexus.classworlds.launcher.Launcher.main(Launcher.java:356)
      at org.codehaus.classworlds.Launcher.main(Launcher.java:47)
      [INFO] -------------------------------------------------------------
      [ERROR] COMPILATION ERROR :
      [INFO] -------------------------------------------------------------
      [ERROR] An unknown compilation problem occurred
      [INFO] 1 error
      [INFO] -------------------------------------------------------------
      [INFO] ------------------------------------------------------------------------
      [INFO] BUILD FAILURE
      [INFO] ------------------------------------------------------------------------
      [INFO] Total time: 3.557 s
      [INFO] Finished at: 2019-02-22T07:17:21-05:00
      [INFO] Final Memory: 16M/214M

      STEPS TO FOLLOW TO REPRODUCE THE PROBLEM :
      when I build my application using maven plugin getting this error

      EXPECTED VERSUS ACTUAL BEHAVIOR :
      EXPECTED -
      code should be complied or report actual bug

        Attachments

          Issue Links

            Activity

              People

              • Assignee:
                pmangal Priyanka Mangal (Inactive)
                Reporter:
                webbuggrp Webbug Group
              • Votes:
                0 Vote for this issue
                Watchers:
                2 Start watching this issue

                Dates

                • Created:
                  Updated:
                  Resolved: