Uploaded image for project: 'JDK'
  1. JDK
  2. JDK-8220393

JAVA Assertion error while compiling

    Details

    • CPU:
      x86_64
    • OS:
      windows_7

      Description

      A DESCRIPTION OF THE PROBLEM :
      Compiling 107 source files to C:\develop\wdp-inf-bnkng-resrcitm-accsdev-mfadevmaint-v1-api\target\classes
      An exception has occurred in the compiler (1.8.0_201). Please file a bug against the Java compiler via the Java bug reporting page (http://bugreport.java.com) after checking the Bug Database (http://bugs.java.com) for duplicates. Include your program and the following diagnostic in your report. Thank you.
      java.lang.AssertionError
      at com.sun.tools.javac.util.Assert.error(Assert.java:126)
      at com.sun.tools.javac.util.Assert.check(Assert.java:45)
      at com.sun.tools.javac.code.SymbolMetadata.setDeclarationAttributesWithCompletion(SymbolMetadata.java:161)
      at com.sun.tools.javac.code.Symbol.setDeclarationAttributesWithCompletion(Symbol.java:215)
      at com.sun.tools.javac.comp.MemberEnter.actualEnterAnnotations(MemberEnter.java:952)
      at com.sun.tools.javac.comp.MemberEnter.access$600(MemberEnter.java:64)
      at com.sun.tools.javac.comp.MemberEnter$5.run(MemberEnter.java:876)
      at com.sun.tools.javac.comp.Annotate.flush(Annotate.java:143)
      at com.sun.tools.javac.comp.Annotate.enterDone(Annotate.java:129)
      at com.sun.tools.javac.comp.Enter.complete(Enter.java:512)
      at com.sun.tools.javac.comp.Enter.main(Enter.java:471)
      at com.sun.tools.javac.main.JavaCompiler.enterTrees(JavaCompiler.java:982)
      at com.sun.tools.javac.main.JavaCompiler.compile(JavaCompiler.java:857)
      at com.sun.tools.javac.main.Main.compile(Main.java:523)
      at com.sun.tools.javac.api.JavacTaskImpl.doCall(JavacTaskImpl.java:129)
      at com.sun.tools.javac.api.JavacTaskImpl.call(JavacTaskImpl.java:138)
      at org.codehaus.plexus.compiler.javac.JavaxToolsCompiler.compileInProcess(JavaxToolsCompiler.java:126)
      at org.codehaus.plexus.compiler.javac.JavacCompiler.performCompile(JavacCompiler.java:174)
      at org.apache.maven.plugin.compiler.AbstractCompilerMojo.execute(AbstractCompilerMojo.java:952)
      at org.apache.maven.plugin.compiler.CompilerMojo.execute(CompilerMojo.java:158)
      at org.apache.maven.plugin.DefaultBuildPluginManager.executeMojo(DefaultBuildPluginManager.java:137)
      at org.apache.maven.lifecycle.internal.MojoExecutor.execute(MojoExecutor.java:208)
      at org.apache.maven.lifecycle.internal.MojoExecutor.execute(MojoExecutor.java:154)
      at org.apache.maven.lifecycle.internal.MojoExecutor.execute(MojoExecutor.java:146)
      at org.apache.maven.lifecycle.internal.LifecycleModuleBuilder.buildProject(LifecycleModuleBuilder.java:117)
      at org.apache.maven.lifecycle.internal.LifecycleModuleBuilder.buildProject(LifecycleModuleBuilder.java:81)
      at org.apache.maven.lifecycle.internal.builder.singlethreaded.SingleThreadedBuilder.build(SingleThreadedBuilder.java:56)
      at org.apache.maven.lifecycle.internal.LifecycleStarter.execute(LifecycleStarter.java:128)
      at org.apache.maven.DefaultMaven.doExecute(DefaultMaven.java:305)
      at org.apache.maven.DefaultMaven.doExecute(DefaultMaven.java:192)
      at org.apache.maven.DefaultMaven.execute(DefaultMaven.java:105)
      at org.apache.maven.cli.MavenCli.execute(MavenCli.java:956)
      at org.apache.maven.cli.MavenCli.doMain(MavenCli.java:290)
      at org.apache.maven.cli.MavenCli.main(MavenCli.java:194)
      at sun.reflect.NativeMethodAccessorImpl.invoke0(Native Method)
      at sun.reflect.NativeMethodAccessorImpl.invoke(NativeMethodAccessorImpl.java:62)
      at sun.reflect.DelegatingMethodAccessorImpl.invoke(DelegatingMethodAccessorImpl.java:43)
      at java.lang.reflect.Method.invoke(Method.java:498)
      at org.codehaus.plexus.classworlds.launcher.Launcher.launchEnhanced(Launcher.java:289)
      at org.codehaus.plexus.classworlds.launcher.Launcher.launch(Launcher.java:229)
      at org.codehaus.plexus.classworlds.launcher.Launcher.mainWithExitCode(Launcher.java:415)
      at org.codehaus.plexus.classworlds.launcher.Launcher.main(Launcher.java:356)
      [INFO] -------------------------------------------------------------
      [ERROR] COMPILATION ERROR :
      [INFO] -------------------------------------------------------------
      [ERROR] An unknown compilation problem occurred
      [INFO] 1 error
      [INFO] -------------------------------------------------------------
      [INFO] ------------------------------------------------------------------------
      [INFO] BUILD FAILURE
      [INFO] ------------------------------------------------------------------------
      [INFO] Total time: 12.727 s
      [INFO] Finished at: 2019-03-08T10:59:17+05:30
      [INFO] ------------------------------------------------------------------------

      REGRESSION : Last worked in version 8u201


      FREQUENCY : always


        Attachments

          Issue Links

            Activity

              People

              • Assignee:
                fmatte Fairoz Matte
                Reporter:
                webbuggrp Webbug Group
              • Votes:
                0 Vote for this issue
                Watchers:
                3 Start watching this issue

                Dates

                • Created:
                  Updated:
                  Resolved: