Uploaded image for project: 'JDK'
  1. JDK
  2. JDK-8221568

DataOutputStream/WriteUTF.java fails due to "OutOfMemoryError: Java heap space"

    Details

    • Subcomponent:
    • Resolved In Build:
      b15
    • CPU:
      x86_64
    • OS:
      os_x

      Description

      The following test failed in the JDK13 CI:

      java/io/DataOutputStream/WriteUTF.java

      Here's a snippet of the log file:

      #section:testng
      ----------messages:(4/164)----------
      command: testng -Xmx2g WriteUTF
      reason: User specified action: run testng/othervm -Xmx2g WriteUTF
      Mode: othervm [/othervm specified]
      elapsed time (seconds): 0.747
      ----------configuration:(0/0)----------
      ----------System.out:(45/2679)----------
      [TestNG] Running:
        java/io/DataOutputStream/WriteUTF.java

      test WriteUTF.arrayIndexOutOfBoundsException(): failure
      java.lang.OutOfMemoryError: Java heap space
      at java.base/java.lang.String.repeat(String.java:3259)
      at WriteUTF.writeUTF(WriteUTF.java:50)
      at WriteUTF.arrayIndexOutOfBoundsException(WriteUTF.java:66)
      at java.base/jdk.internal.reflect.NativeMethodAccessorImpl.invoke0(Native Method)
      at java.base/jdk.internal.reflect.NativeMethodAccessorImpl.invoke(NativeMethodAccessorImpl.java:62)
      at java.base/jdk.internal.reflect.DelegatingMethodAccessorImpl.invoke(DelegatingMethodAccessorImpl.java:43)
      at java.base/java.lang.reflect.Method.invoke(Method.java:567)
      at org.testng.internal.MethodInvocationHelper.invokeMethod(MethodInvocationHelper.java:85)
      at org.testng.internal.Invoker.invokeMethod(Invoker.java:639)
      at org.testng.internal.Invoker.invokeTestMethod(Invoker.java:821)
      at org.testng.internal.Invoker.invokeTestMethods(Invoker.java:1131)
      at org.testng.internal.TestMethodWorker.invokeTestMethods(TestMethodWorker.java:124)
      at org.testng.internal.TestMethodWorker.run(TestMethodWorker.java:108)
      at org.testng.TestRunner.privateRun(TestRunner.java:773)
      at org.testng.TestRunner.run(TestRunner.java:623)
      at org.testng.SuiteRunner.runTest(SuiteRunner.java:357)
      at org.testng.SuiteRunner.runSequentially(SuiteRunner.java:352)
      at org.testng.SuiteRunner.privateRun(SuiteRunner.java:310)
      at org.testng.SuiteRunner.run(SuiteRunner.java:259)
      at org.testng.SuiteRunnerWorker.runSuite(SuiteRunnerWorker.java:52)
      at org.testng.SuiteRunnerWorker.run(SuiteRunnerWorker.java:86)
      at org.testng.TestNG.runSuitesSequentially(TestNG.java:1185)
      at org.testng.TestNG.runSuitesLocally(TestNG.java:1110)
      at org.testng.TestNG.run(TestNG.java:1018)
      at com.sun.javatest.regtest.agent.TestNGRunner.main(TestNGRunner.java:94)
      at com.sun.javatest.regtest.agent.TestNGRunner.main(TestNGRunner.java:54)
      at java.base/jdk.internal.reflect.NativeMethodAccessorImpl.invoke0(Native Method)
      at java.base/jdk.internal.reflect.NativeMethodAccessorImpl.invoke(NativeMethodAccessorImpl.java:62)
      at java.base/jdk.internal.reflect.DelegatingMethodAccessorImpl.invoke(DelegatingMethodAccessorImpl.java:43)
      at java.base/java.lang.reflect.Method.invoke(Method.java:567)
      at com.sun.javatest.regtest.agent.MainWrapper$MainThread.run(MainWrapper.java:127)
      at java.base/java.lang.Thread.run(Thread.java:835)
      test WriteUTF.overcountWrittenField(): success
      test WriteUTF.utfDataFormatException(): success

      ===============================================
      java/io/DataOutputStream/WriteUTF.java
      Total tests run: 3, Failures: 1, Skips: 0
      ===============================================

      ----------System.err:(14/858)----------
      java.lang.Exception: failures: 1
      at com.sun.javatest.regtest.agent.TestNGRunner.main(TestNGRunner.java:96)
      at com.sun.javatest.regtest.agent.TestNGRunner.main(TestNGRunner.java:54)
      at java.base/jdk.internal.reflect.NativeMethodAccessorImpl.invoke0(Native Method)
      at java.base/jdk.internal.reflect.NativeMethodAccessorImpl.invoke(NativeMethodAccessorImpl.java:62)
      at java.base/jdk.internal.reflect.DelegatingMethodAccessorImpl.invoke(DelegatingMethodAccessorImpl.java:43)
      at java.base/java.lang.reflect.Method.invoke(Method.java:567)
      at com.sun.javatest.regtest.agent.MainWrapper$MainThread.run(MainWrapper.java:127)
      at java.base/java.lang.Thread.run(Thread.java:835)

      JavaTest Message: Test threw exception: java.lang.Exception: failures: 1
      JavaTest Message: shutting down test

      STATUS:Failed.`main' threw exception: java.lang.Exception: failures: 1
      ----------rerun:(32/4438)*----------

      With the '/othervm' and '-Xmx2g' options, I'm surprised this test failed
      due to OutOfMemoryError.

        Attachments

          Issue Links

            Activity

              People

              • Assignee:
                bpb Brian Burkhalter
                Reporter:
                dcubed Daniel Daugherty
              • Votes:
                0 Vote for this issue
                Watchers:
                3 Start watching this issue

                Dates

                • Created:
                  Updated:
                  Resolved: