Uploaded image for project: 'JDK'
  1. JDK
  2. JDK-8222812

java usage unit tests are failing

    Details

    • Subcomponent:
    • Resolved In Build:
      b01

      Backports

        Description

        The java usage tests are failing for 8cpu

        [----------] Global test environment tear-down
        [==========] 412 tests from 60 test cases ran. (258213 ms total)
        [ PASSED ] 409 tests.
        [ FAILED ] 3 tests, listed below:
        [ FAILED ] JavaUsageTests.test3
        [ FAILED ] JavaUsageTests.test6
        [ FAILED ] JavaUsageTests.test7

         3 FAILED TESTS
        Running settings_test.exe...

          Attachments

            Issue Links

              Activity

                People

                • Assignee:
                  billyh William Harnois
                  Reporter:
                  billyh William Harnois
                • Votes:
                  0 Vote for this issue
                  Watchers:
                  3 Start watching this issue

                  Dates

                  • Created:
                    Updated:
                    Resolved: