Uploaded image for project: 'JDK'
  1. JDK
  2. JDK-8223539

compiler/graalunit/HotspotTest.java hotspot.test.CheckGraalIntrinsics AssertionError: found plugins for intrinsics characterized as toBeInvestigated

    Details

    • Subcomponent:
    • Resolved In Build:
      b21
    • Verification:
      Verified

      Description

      compiler/graalunit/HotspotTest.java

      jib > There was 1 failure:
      jib > 1) test(org.graalvm.compiler.hotspot.test.CheckGraalIntrinsics)
      jib > java.lang.AssertionError: found plugins for intrinsics characterized as toBeInvestigated:
      jib > java/lang/Math.abs(F)F
      jib >
      jib > at org.graalvm.compiler.hotspot.test.CheckGraalIntrinsics.test(CheckGraalIntrinsics.java:649)
      jib > at java.base/jdk.internal.reflect.NativeMethodAccessorImpl.invoke0(Native Method)
      jib > at java.base/jdk.internal.reflect.NativeMethodAccessorImpl.invoke(NativeMethodAccessorImpl.java:62)
      jib > at java.base/jdk.internal.reflect.DelegatingMethodAccessorImpl.invoke(DelegatingMethodAccessorImpl.java:43)
      jib > at java.base/java.lang.reflect.Method.invoke(Method.java:567)
      jib > at org.junit.runners.model.FrameworkMethod$1.runReflectiveCall(FrameworkMethod.java:50)
      jib > at org.junit.internal.runners.model.ReflectiveCallable.run(ReflectiveCallable.java:12)
      jib > at org.junit.runners.model.FrameworkMethod.invokeExplosively(FrameworkMethod.java:47)
      jib > at org.junit.internal.runners.statements.InvokeMethod.evaluate(InvokeMethod.java:17)
      jib > at org.junit.internal.runners.statements.RunAfters.evaluate(RunAfters.java:27)
      jib > at org.junit.runners.ParentRunner.runLeaf(ParentRunner.java:325)
      jib > at org.junit.runners.BlockJUnit4ClassRunner.runChild(BlockJUnit4ClassRunner.java:78)
      jib > at org.junit.runners.BlockJUnit4ClassRunner.runChild(BlockJUnit4ClassRunner.java:57)
      jib > at org.junit.runners.ParentRunner$3.run(ParentRunner.java:290)
      jib > at org.junit.runners.ParentRunner$1.schedule(ParentRunner.java:71)
      jib > at org.junit.runners.ParentRunner.runChildren(ParentRunner.java:288)
      jib > at org.junit.runners.ParentRunner.access$000(ParentRunner.java:58)
      jib > at org.junit.runners.ParentRunner$2.evaluate(ParentRunner.java:268)
      jib > at org.junit.runners.ParentRunner.run(ParentRunner.java:363)
      jib > at org.junit.runners.Suite.runChild(Suite.java:128)
      jib > at org.junit.runners.Suite.runChild(Suite.java:27)
      jib > at org.junit.runners.ParentRunner$3.run(ParentRunner.java:290)
      jib > at org.junit.runners.ParentRunner$1.schedule(ParentRunner.java:71)
      jib > at org.junit.runners.ParentRunner.runChildren(ParentRunner.java:288)
      jib > at org.junit.runners.ParentRunner.access$000(ParentRunner.java:58)
      jib > at org.junit.runners.ParentRunner$2.evaluate(ParentRunner.java:268)
      jib > at org.junit.runners.ParentRunner.run(ParentRunner.java:363)
      jib > at org.junit.runner.JUnitCore.run(JUnitCore.java:137)
      jib > at org.junit.runner.JUnitCore.run(JUnitCore.java:115)
      jib > at com.oracle.mxtool.junit.MxJUnitWrapper.runRequest(MxJUnitWrapper.java:280)
      jib > at com.oracle.mxtool.junit.MxJUnitWrapper.main(MxJUnitWrapper.java:196)
      jib >
      jib > FAILURES!!!
      jib > Tests run: 301, Failures: 1

        Attachments

          Activity

            People

            • Assignee:
              kvn Vladimir Kozlov
              Reporter:
              ljiang Leo Jiang
            • Votes:
              0 Vote for this issue
              Watchers:
              3 Start watching this issue

              Dates

              • Created:
                Updated:
                Resolved: