Uploaded image for project: 'JDK'
  1. JDK
  2. JDK-8229253

forkjoin/FJExceptionTableLeak.java fails "AssertionError: failed to satisfy condition"

    Details

      Description

      The following test is failing in the jdk/jdk CI:

      java/util/concurrent/forkjoin/FJExceptionTableLeak.java

      Here's a snippet from the log file:

      ----------System.out:(40/2445)----------
      [TestNG] Running:
        java/util/concurrent/forkjoin/FJExceptionTableLeak.java

      test FJExceptionTableLeak.exceptionTableCleanup(): failure
      java.lang.AssertionError: failed to satisfy condition
      at FJExceptionTableLeak.gcAwait(FJExceptionTableLeak.java:202)
      at FJExceptionTableLeak.exceptionTableCleanup(FJExceptionTableLeak.java:137)
      at java.base/jdk.internal.reflect.NativeMethodAccessorImpl.invoke0(Native Method)
      at java.base/jdk.internal.reflect.NativeMethodAccessorImpl.invoke(NativeMethodAccessorImpl.java:62)
      at java.base/jdk.internal.reflect.DelegatingMethodAccessorImpl.invoke(DelegatingMethodAccessorImpl.java:43)
      at java.base/java.lang.reflect.Method.invoke(Method.java:567)
      at org.testng.internal.MethodInvocationHelper.invokeMethod(MethodInvocationHelper.java:85)
      at org.testng.internal.Invoker.invokeMethod(Invoker.java:639)
      at org.testng.internal.Invoker.invokeTestMethod(Invoker.java:821)
      at org.testng.internal.Invoker.invokeTestMethods(Invoker.java:1131)
      at org.testng.internal.TestMethodWorker.invokeTestMethods(TestMethodWorker.java:124)
      at org.testng.internal.TestMethodWorker.run(TestMethodWorker.java:108)
      at org.testng.TestRunner.privateRun(TestRunner.java:773)
      at org.testng.TestRunner.run(TestRunner.java:623)
      at org.testng.SuiteRunner.runTest(SuiteRunner.java:357)
      at org.testng.SuiteRunner.runSequentially(SuiteRunner.java:352)
      at org.testng.SuiteRunner.privateRun(SuiteRunner.java:310)
      at org.testng.SuiteRunner.run(SuiteRunner.java:259)
      at org.testng.SuiteRunnerWorker.runSuite(SuiteRunnerWorker.java:52)
      at org.testng.SuiteRunnerWorker.run(SuiteRunnerWorker.java:86)
      at org.testng.TestNG.runSuitesSequentially(TestNG.java:1185)
      at org.testng.TestNG.runSuitesLocally(TestNG.java:1110)
      at org.testng.TestNG.run(TestNG.java:1018)
      at com.sun.javatest.regtest.agent.TestNGRunner.main(TestNGRunner.java:94)
      at jdk.internal.reflect.GeneratedMethodAccessor15.invoke(Unknown Source)
      at java.base/jdk.internal.reflect.DelegatingMethodAccessorImpl.invoke(DelegatingMethodAccessorImpl.java:43)
      at java.base/java.lang.reflect.Method.invoke(Method.java:567)
      at com.sun.javatest.regtest.agent.MainActionHelper$AgentVMRunnable.run(MainActionHelper.java:298)
      at java.base/java.lang.Thread.run(Thread.java:830)

      ===============================================
      java/util/concurrent/forkjoin/FJExceptionTableLeak.java
      Total tests run: 1, Failures: 1, Skips: 0
      ===============================================

      ----------System.err:(11/604)----------
      java.lang.Exception: failures: 1
      at com.sun.javatest.regtest.agent.TestNGRunner.main(TestNGRunner.java:96)
      at jdk.internal.reflect.GeneratedMethodAccessor15.invoke(Unknown Source)
      at java.base/jdk.internal.reflect.DelegatingMethodAccessorImpl.invoke(DelegatingMethodAccessorImpl.java:43)
      at java.base/java.lang.reflect.Method.invoke(Method.java:567)
      at com.sun.javatest.regtest.agent.MainActionHelper$AgentVMRunnable.run(MainActionHelper.java:298)
      at java.base/java.lang.Thread.run(Thread.java:830)

      JavaTest Message: Test threw exception: java.lang.Exception
      JavaTest Message: shutting down test

      result: Failed. Execution failed: `main' threw exception: java.lang.Exception: failures: 1


      test result: Failed. Execution failed: `main' threw exception: java.lang.Exception: failures: 1

        Attachments

          Activity

            People

            • Assignee:
              martin Martin Buchholz
              Reporter:
              dcubed Daniel Daugherty
            • Votes:
              0 Vote for this issue
              Watchers:
              4 Start watching this issue

              Dates

              • Created:
                Updated: