Uploaded image for project: 'JDK'
  1. JDK
  2. JDK-8231930

Windows build fails after JDK-8191521

    Details

    • Subcomponent:
    • Resolved In Build:
      b18
    • OS:
      windows
    • Verification:
      Verified

      Backports

        Description

        This is similar to JDK-8219583:

        c:/cygwin64/home/windows/worker/jdkX-windows/build/test/hotspot/gtest/runtime/test_os_windows.cpp(357) : error C3861: 'snprintf': identifier not found
        make[3]: *** [lib/CompileGtest.gmk:60: /cygdrive/c/cygwin64/home/windows/worker/jdkX-windows/build/build/windows-x86_64-server-fastdebug/hotspot/variant-server/libjvm/gtest/objs/test_os_windows.obj] Error 1
        make[3]: *** Waiting for unfinished jobs....
        make[2]: *** [make/Main.gmk:253: hotspot-server-libs] Error 2

        Should be os::snprintf.

          Attachments

            Issue Links

              Activity

                People

                • Assignee:
                  shade Aleksey Shipilev
                  Reporter:
                  shade Aleksey Shipilev
                • Votes:
                  0 Vote for this issue
                  Watchers:
                  3 Start watching this issue

                  Dates

                  • Created:
                    Updated:
                    Resolved: