Uploaded image for project: 'JDK'
  1. JDK
  2. JDK-8237479

8230305 causes slowdebug build failure

    XMLWordPrintable

    Details

    • Subcomponent:
    • Resolved In Build:
      b07
    • CPU:
      x86_64
    • OS:
      linux
    • Verification:
      Not verified

      Description

      Robbin reported a slowdebug build failure this morning:

      /home/rehn/source/jdk/vanilla-jdk/open/src/hotspot/os/linux/cgroupSubsystem_linux.hpp:59: error: undefined reference to 'vtable for CgroupController'
      /usr/bin/ld: the vtable symbol may be undefined because the class is missing its key function
      /home/rehn/source/jdk/vanilla-jdk/open/src/hotspot/os/linux/cgroupSubsystem_linux.hpp:225: error: undefined reference to 'vtable for CgroupSubsystem'
      /usr/bin/ld: the vtable symbol may be undefined because the class is missing its key function
      collect2: error: ld returned 1 exit status

      And slowdebug build failures have shown up in Tier2.

      Starting this bug as a P2 since we have build failures.

        Attachments

          Issue Links

            Activity

              People

              Assignee:
              sgehwolf Severin Gehwolf
              Reporter:
              dcubed Daniel Daugherty
              Votes:
              0 Vote for this issue
              Watchers:
              6 Start watching this issue

                Dates

                Created:
                Updated:
                Resolved: