Uploaded image for project: 'JDK'
  1. JDK
  2. JDK-8238814

[TESTBUG] [macos] closed test javax/swing/text/html/HTMLDocument/5013529/bug5013529.java fails on macOS

    Details

      Description


      java.lang.RuntimeException: Test failed.
      at bug5013529.run(bug5013529.java:71)
      at bug5013529.<init>(bug5013529.java:24)
      at bug5013529.main(bug5013529.java:76)
      at java.base/jdk.internal.reflect.NativeMethodAccessorImpl.invoke0(Native Method)
      at java.base/jdk.internal.reflect.NativeMethodAccessorImpl.invoke(NativeMethodAccessorImpl.java:62)
      at java.base/jdk.internal.reflect.DelegatingMethodAccessorImpl.invoke(DelegatingMethodAccessorImpl.java:43)
      at java.base/java.lang.reflect.Method.invoke(Method.java:564)
      at com.sun.javatest.regtest.agent.MainWrapper$MainThread.run(MainWrapper.java:127)
      at java.base/java.lang.Thread.run(Thread.java:832)

      JavaTest Message: Test threw exception: java.lang.RuntimeException: Test failed.
      JavaTest Message: shutting down test

      STATUS:Failed.`main' threw exception: java.lang.RuntimeException: Test failed.

        Attachments

          Activity

            People

            • Assignee:
              psadhukhan Prasanta Sadhukhan
              Reporter:
              prr Philip Race
            • Votes:
              0 Vote for this issue
              Watchers:
              2 Start watching this issue

              Dates

              • Created:
                Updated:
                Resolved: