Uploaded image for project: 'JDK'
  1. JDK
  2. JDK-8239961

[GRAAL] LogGeneratedClassesTest.java test failed with libgraal

    XMLWordPrintable

    Details

      Description

      java/lang/invoke/lambda/LogGeneratedClassesTest.java

      test LogGeneratedClassesTest.testDumpDirIsFile(): failure
      java.lang.AssertionError: only show error once expected [1] but found [0]
      at org.testng.Assert.fail(Assert.java:94)
      at org.testng.Assert.failNotEquals(Assert.java:496)
      at org.testng.Assert.assertEquals(Assert.java:125)
      at org.testng.Assert.assertEquals(Assert.java:267)
      at LogGeneratedClassesTest.testDumpDirIsFile(LogGeneratedClassesTest.java:161)

      test LogGeneratedClassesTest.testDumpDirNotExist(): failure
      java.lang.AssertionError: only show error once expected [1] but found [0]
      at org.testng.Assert.fail(Assert.java:94)
      at org.testng.Assert.failNotEquals(Assert.java:496)
      at org.testng.Assert.assertEquals(Assert.java:125)
      at org.testng.Assert.assertEquals(Assert.java:267)
      at LogGeneratedClassesTest.testDumpDirNotExist(LogGeneratedClassesTest.java:146)

      test LogGeneratedClassesTest.testDumpDirNotWritable(): failure
      java.lang.AssertionError: only show error once expected [1] but found [0]
      at org.testng.Assert.fail(Assert.java:94)
      at org.testng.Assert.failNotEquals(Assert.java:496)
      at org.testng.Assert.assertEquals(Assert.java:125)
      at org.testng.Assert.assertEquals(Assert.java:267)
      at LogGeneratedClassesTest.testDumpDirNotWritable(LogGeneratedClassesTest.java:219)

        Attachments

          Activity

            People

            Assignee:
            kvn Vladimir Kozlov
            Reporter:
            kvn Vladimir Kozlov
            Votes:
            0 Vote for this issue
            Watchers:
            1 Start watching this issue

              Dates

              Created:
              Updated: