Uploaded image for project: 'JDK'
  1. JDK
  2. JDK-8240549

jshell/JdiListeningExecutionControlTest.java failed due to setup failure

    Details

    • Type: Bug
    • Status: Open
    • Priority: P3
    • Resolution: Unresolved
    • Affects Version/s: 15
    • Fix Version/s: tbd
    • Component/s: tools
    • Subcomponent:
    • CPU:
      x86_64
    • OS:
      os_x

      Description

      The following test failed in the JDK15 CI:

      jdk/jshell/JdiListeningExecutionControlTest.java

      Here's a snippet from the log file:

      ----------System.out:(87/6108)----------
      [TestNG] Running:
        jdk/jshell/JdiListeningExecutionControlTest.java

      config JdiListeningExecutionControlTest.setUp(): success
      test ExecutionControlTestBase.classesDeclaration(): success
      config KullaTesting.tearDown(): success
      config JdiListeningExecutionControlTest.setUp(): success
      test ExecutionControlTestBase.interfaceTest(): success
      config KullaTesting.tearDown(): success
      config JdiListeningExecutionControlTest.setUp(): failure
      java.lang.IllegalStateException: Launching JShell execution engine threw: Failed remote listen: java.util.concurrent.ExecutionException: com.sun.jdi.connect.TransportTimeoutException: timeout waiting for connection @ com.sun.jdi.SocketListen (defaults: timeout=, port=, localAddress=) -- {timeout=timeout=5000, port=port=60265, localAddress=localAddress=}
      at jdk.jshell/jdk.jshell.JShell.<init>(JShell.java:139)
      at jdk.jshell/jdk.jshell.JShell$Builder.build(JShell.java:405)
      at KullaTesting.setUp(KullaTesting.java:197)
      at JdiListeningExecutionControlTest.setUp(JdiListeningExecutionControlTest.java:44)
      at java.base/jdk.internal.reflect.NativeMethodAccessorImpl.invoke0(Native Method)
      at java.base/jdk.internal.reflect.NativeMethodAccessorImpl.invoke(NativeMethodAccessorImpl.java:62)
      at java.base/jdk.internal.reflect.DelegatingMethodAccessorImpl.invoke(DelegatingMethodAccessorImpl.java:43)
      at java.base/java.lang.reflect.Method.invoke(Method.java:564)
      at org.testng.internal.MethodInvocationHelper.invokeMethod(MethodInvocationHelper.java:85)
      at org.testng.internal.Invoker.invokeConfigurationMethod(Invoker.java:510)
      at org.testng.internal.Invoker.invokeConfigurations(Invoker.java:211)
      at org.testng.internal.Invoker.invokeMethod(Invoker.java:585)
      at org.testng.internal.Invoker.invokeTestMethod(Invoker.java:821)
      at org.testng.internal.Invoker.invokeTestMethods(Invoker.java:1131)
      at org.testng.internal.TestMethodWorker.invokeTestMethods(TestMethodWorker.java:124)
      at org.testng.internal.TestMethodWorker.run(TestMethodWorker.java:108)
      at org.testng.TestRunner.privateRun(TestRunner.java:773)
      at org.testng.TestRunner.run(TestRunner.java:623)
      at org.testng.SuiteRunner.runTest(SuiteRunner.java:357)
      at org.testng.SuiteRunner.runSequentially(SuiteRunner.java:352)
      at org.testng.SuiteRunner.privateRun(SuiteRunner.java:310)
      at org.testng.SuiteRunner.run(SuiteRunner.java:259)
      at org.testng.SuiteRunnerWorker.runSuite(SuiteRunnerWorker.java:52)
      at org.testng.SuiteRunnerWorker.run(SuiteRunnerWorker.java:86)
      at org.testng.TestNG.runSuitesSequentially(TestNG.java:1185)
      at org.testng.TestNG.runSuitesLocally(TestNG.java:1110)
      at org.testng.TestNG.run(TestNG.java:1018)
      at com.sun.javatest.regtest.agent.TestNGRunner.main(TestNGRunner.java:94)
      at java.base/jdk.internal.reflect.NativeMethodAccessorImpl.invoke0(Native Method)
      at java.base/jdk.internal.reflect.NativeMethodAccessorImpl.invoke(NativeMethodAccessorImpl.java:62)
      at java.base/jdk.internal.reflect.DelegatingMethodAccessorImpl.invoke(DelegatingMethodAccessorImpl.java:43)
      at java.base/java.lang.reflect.Method.invoke(Method.java:564)
      at com.sun.javatest.regtest.agent.MainActionHelper$AgentVMRunnable.run(MainActionHelper.java:298)
      at java.base/java.lang.Thread.run(Thread.java:832)
      Caused by: java.lang.InternalError: Failed remote listen: java.util.concurrent.ExecutionException: com.sun.jdi.connect.TransportTimeoutException: timeout waiting for connection @ com.sun.jdi.SocketListen (defaults: timeout=, port=, localAddress=) -- {timeout=timeout=5000, port=port=60265, localAddress=localAddress=}
      at jdk.jshell/jdk.jshell.execution.JdiInitiator.reportLaunchFail(JdiInitiator.java:300)
      at jdk.jshell/jdk.jshell.execution.JdiInitiator.listenTarget(JdiInitiator.java:199)
      at jdk.jshell/jdk.jshell.execution.JdiInitiator.<init>(JdiInitiator.java:111)
      at jdk.jshell/jdk.jshell.execution.JdiDefaultExecutionControl.create(JdiDefaultExecutionControl.java:103)
      at jdk.jshell/jdk.jshell.execution.JdiExecutionControlProvider.generate(JdiExecutionControlProvider.java:152)
      at jdk.jshell/jdk.jshell.spi.ExecutionControl.generate(ExecutionControl.java:179)
      at jdk.jshell/jdk.jshell.spi.ExecutionControl.generate(ExecutionControl.java:296)
      at jdk.jshell/jdk.jshell.JShell.<init>(JShell.java:136)
      ... 33 more
      Caused by: java.util.concurrent.ExecutionException: com.sun.jdi.connect.TransportTimeoutException: timeout waiting for connection
      at java.base/java.util.concurrent.FutureTask.report(FutureTask.java:122)
      at java.base/java.util.concurrent.FutureTask.get(FutureTask.java:205)
      at jdk.jshell/jdk.jshell.execution.JdiInitiator.timedVirtualMachineCreation(JdiInitiator.java:244)
      at jdk.jshell/jdk.jshell.execution.JdiInitiator.listenTarget(JdiInitiator.java:176)
      ... 39 more
      Caused by: com.sun.jdi.connect.TransportTimeoutException: timeout waiting for connection
      at jdk.jdi/com.sun.tools.jdi.SocketTransportService.accept(SocketTransportService.java:377)
      at jdk.jdi/com.sun.tools.jdi.GenericListeningConnector.accept(GenericListeningConnector.java:155)
      at jdk.jshell/jdk.jshell.execution.JdiInitiator.lambda$listenTarget$1(JdiInitiator.java:176)
      at java.base/java.util.concurrent.FutureTask.run(FutureTask.java:264)
      at java.base/java.util.concurrent.ThreadPoolExecutor.runWorker(ThreadPoolExecutor.java:1130)
      at java.base/java.util.concurrent.ThreadPoolExecutor$Worker.run(ThreadPoolExecutor.java:630)
      ... 1 more
      test ExecutionControlTestBase.methodOverload(): skip
      config KullaTesting.tearDown(): skip
      config JdiListeningExecutionControlTest.setUp(): skip
      test ExecutionControlTestBase.testExprSanity(): skip
      config KullaTesting.tearDown(): skip
      config JdiListeningExecutionControlTest.setUp(): skip
      test ExecutionControlTestBase.testImportOnDemand(): skip
      config KullaTesting.tearDown(): skip
      config JdiListeningExecutionControlTest.setUp(): skip
      test ExecutionControlTestBase.variables(): skip
      config KullaTesting.tearDown(): skip

      ===============================================
      jdk/jshell/JdiListeningExecutionControlTest.java
      Total tests run: 6, Failures: 0, Skips: 4
      Configuration Failures: 1, Skips: 7
      ===============================================

      ----------System.err:(12/714)----------


      This bug is specific to tracking a JdiListeningExecutionControlTest.setUp()
      failure due to this type of message:

      Failed remote listen: java.util.concurrent.ExecutionException: com.sun.jdi.connect.TransportTimeoutException: timeout waiting for connection

      PLEASE DO NOT ADD OTHER FAILURE MODES TO THIS BUG.

      Starting this bug as a P3 since this is a Tier2 failure.

        Attachments

          Activity

            People

            • Assignee:
              rfield Robert Field
              Reporter:
              dcubed Daniel Daugherty
            • Votes:
              0 Vote for this issue
              Watchers:
              1 Start watching this issue

              Dates

              • Created:
                Updated: