Uploaded image for project: 'JDK'
  1. JDK
  2. JDK-8244866

[vector] Build of vectorIntrinsics branch fails on Windows

    Details

      Description

      The attempt to build vectorIntrinsics branch fails on Windows with

      [2020-05-12T23:18:19,213Z] [jib LOG] make CONF_NAME=windows-x64-debug
      [2020-05-12T23:18:19,291Z] Building configuration 'windows-x64-debug' (matching CONF_NAME=windows-x64-debug)
      [2020-05-12T23:18:29,775Z] Building configuration 'windows-x64-debug' (matching CONF_NAME=windows-x64-debug)
      [2020-05-12T23:18:30,010Z] Building target 'default (product-bundles test-bundles static-libs-bundles)' in configuration 'windows-x64-debug'
      [2020-05-12T23:18:30,853Z] Compiling 8 files for BUILD_TOOLS_LANGTOOLS
      [2020-05-12T23:18:30,885Z] Warning: No SCM configuration present and no .src-rev
      [2020-05-12T23:18:33,719Z] Parsing 2 properties into enum-like class for jdk.compiler
      [2020-05-12T23:18:33,766Z] Compiling 10 properties into resource bundles for jdk.javadoc
      [2020-05-12T23:18:33,782Z] Compiling 7 properties into resource bundles for jdk.jshell
      [2020-05-12T23:18:33,797Z] Compiling 19 properties into resource bundles for jdk.compiler
      [2020-05-12T23:18:33,849Z] Compiling 12 properties into resource bundles for jdk.jdeps
      [2020-05-12T23:18:34,603Z] gensrc/GensrcAdlc.gmk:65: *** multiple target patterns. Stop.
      [2020-05-12T23:18:34,603Z] make/Main.gmk:244: recipe for target 'hotspot-server-gensrc' failed
      [2020-05-12T23:18:34,603Z] make[2]: *** [hotspot-server-gensrc] Error 2
      [2020-05-12T23:18:34,603Z] make[2]: *** Waiting for unfinished jobs....
      [2020-05-12T23:18:35,166Z] Compiling 127 files for BUILD_java.compiler.interim
      [2020-05-12T23:18:37,689Z] Compiling 405 files for BUILD_jdk.compiler.interim
      [2020-05-12T23:18:53,899Z] Compiling 217 files for BUILD_jdk.javadoc.interim
      [2020-05-12T23:19:00,253Z]
      [2020-05-12T23:19:00,253Z] ERROR: Build failed for target 'default (product-bundles test-bundles static-libs-bundles)' in configuration 'windows-x64-debug' (exit code 2)
      [2020-05-12T23:19:00,894Z]
      [2020-05-12T23:19:00,894Z] === Make failed targets repeated here ===
      [2020-05-12T23:19:00,925Z] make/Main.gmk:244: recipe for target 'hotspot-server-gensrc' failed
      [2020-05-12T23:19:00,941Z] === End of repeated output ===
      [2020-05-12T23:19:00,957Z]
      [2020-05-12T23:19:00,957Z] Hint: Try searching the build log for the name of the first failed target.
      [2020-05-12T23:19:01,004Z] Hint: See doc/building.html#troubleshooting for assistance.
      [2020-05-12T23:19:01,004Z]
      [2020-05-12T23:19:01,004Z] /cygdrive/t/workspace/open/make/Init.gmk:307: recipe for target 'main' failed
      [2020-05-12T23:19:01,004Z] make[1]: *** [main] Error 2
      [2020-05-12T23:19:01,004Z] /cygdrive/t/workspace/open/make/Init.gmk:186: recipe for target 'default' failed
      [2020-05-12T23:19:01,004Z] make: *** [default] Error 2

      The error is not new one and is present for at least one week.

        Attachments

          Activity

            People

            • Assignee:
              srukmannagar Shravya Rukmannagari
              Reporter:
              epavlova Ekaterina Pavlova
            • Votes:
              0 Vote for this issue
              Watchers:
              3 Start watching this issue

              Dates

              • Created:
                Updated:
                Resolved: