Uploaded image for project: 'JDK'
  1. JDK
  2. JDK-8248791

sun/util/resources/cldr/TimeZoneNamesTest.java fails with -XX:-ReduceInitialCardMarks -XX:-ReduceBulkZeroing

    Details

    • Subcomponent:
    • Resolved In Build:
      b12

      Backports

        Description

        The test sun/util/resources/cldr/TimeZoneNamesTest.java fails by setting the additional flags -XX:-ReduceInitialCardMarks and -XX:-ReduceBulkZeroing.

        The failure can only be observed with a product build but not with a debug build.

        test TimeZoneNamesTest.test_tzNames("Asia/Srednekolymsk", en_US, "Srednekolymsk Standard Time", "GMT+11:00", "Srednekolymsk Daylight Time", "GMT+11:00", "Srednekolymsk Time", "GMT+11:00"): failure
        java.lang.AssertionError: expected [GMT+11:00] but found [GMT]
        at org.testng.Assert.fail(Assert.java:94)
        at org.testng.Assert.failNotEquals(Assert.java:496)
        at org.testng.Assert.assertEquals(Assert.java:125)
        at org.testng.Assert.assertEquals(Assert.java:178)
        at org.testng.Assert.assertEquals(Assert.java:188)
        at TimeZoneNamesTest.test_tzNames(TimeZoneNamesTest.java:185)
        at java.base/jdk.internal.reflect.NativeMethodAccessorImpl.invoke0(Native Method)
        at java.base/jdk.internal.reflect.NativeMethodAccessorImpl.invoke(NativeMethodAccessorImpl.java:64)
        at java.base/jdk.internal.reflect.DelegatingMethodAccessorImpl.invoke(DelegatingMethodAccessorImpl.java:43)
        at java.base/java.lang.reflect.Method.invoke(Method.java:564)
        at org.testng.internal.MethodInvocationHelper.invokeMethod(MethodInvocationHelper.java:85)
        at org.testng.internal.Invoker.invokeMethod(Invoker.java:639)
        at org.testng.internal.Invoker.invokeTestMethod(Invoker.java:821)
        at org.testng.internal.Invoker.invokeTestMethods(Invoker.java:1131)
        at org.testng.internal.TestMethodWorker.invokeTestMethods(TestMethodWorker.java:125)
        at org.testng.internal.TestMethodWorker.run(TestMethodWorker.java:108)
        at org.testng.TestRunner.privateRun(TestRunner.java:773)
        at org.testng.TestRunner.run(TestRunner.java:623)
        at org.testng.SuiteRunner.runTest(SuiteRunner.java:357)
        at org.testng.SuiteRunner.runSequentially(SuiteRunner.java:352)
        at org.testng.SuiteRunner.privateRun(SuiteRunner.java:310)
        at org.testng.SuiteRunner.run(SuiteRunner.java:259)
        at org.testng.SuiteRunnerWorker.runSuite(SuiteRunnerWorker.java:52)
        at org.testng.SuiteRunnerWorker.run(SuiteRunnerWorker.java:86)
        at org.testng.TestNG.runSuitesSequentially(TestNG.java:1185)
        at org.testng.TestNG.runSuitesLocally(TestNG.java:1110)
        at org.testng.TestNG.run(TestNG.java:1018)
        at com.sun.javatest.regtest.agent.TestNGRunner.main(TestNGRunner.java:94)
        at com.sun.javatest.regtest.agent.TestNGRunner.main(TestNGRunner.java:54)
        at java.base/jdk.internal.reflect.NativeMethodAccessorImpl.invoke0(Native Method)
        at java.base/jdk.internal.reflect.NativeMethodAccessorImpl.invoke(NativeMethodAccessorImpl.java:64)
        at java.base/jdk.internal.reflect.DelegatingMethodAccessorImpl.invoke(DelegatingMethodAccessorImpl.java:43)
        at java.base/java.lang.reflect.Method.invoke(Method.java:564)
        at com.sun.javatest.regtest.agent.MainWrapper$MainThread.run(MainWrapper.java:127)
        at java.base/java.lang.Thread.run(Thread.java:832)
        test TimeZoneNamesTest.test_tzNames("Asia/Srednekolymsk", fr_FR, "Srednekolymsk (heure standard)", "UTC+11:00", "Srednekolymsk (heure d’été)", "UTC+11:00", "heure : Srednekolymsk", "UTC+11:00"): failure
        java.lang.AssertionError: expected [UTC+11:00] but found [UTC]
        at org.testng.Assert.fail(Assert.java:94)
        at org.testng.Assert.failNotEquals(Assert.java:496)
        at org.testng.Assert.assertEquals(Assert.java:125)
        at org.testng.Assert.assertEquals(Assert.java:178)
        at org.testng.Assert.assertEquals(Assert.java:188)
        at TimeZoneNamesTest.test_tzNames(TimeZoneNamesTest.java:185)
        at java.base/jdk.internal.reflect.NativeMethodAccessorImpl.invoke0(Native Method)
        at java.base/jdk.internal.reflect.NativeMethodAccessorImpl.invoke(NativeMethodAccessorImpl.java:64)
        at java.base/jdk.internal.reflect.DelegatingMethodAccessorImpl.invoke(DelegatingMethodAccessorImpl.java:43)
        at java.base/java.lang.reflect.Method.invoke(Method.java:564)
        at org.testng.internal.MethodInvocationHelper.invokeMethod(MethodInvocationHelper.java:85)
        at org.testng.internal.Invoker.invokeMethod(Invoker.java:639)
        at org.testng.internal.Invoker.invokeTestMethod(Invoker.java:821)
        at org.testng.internal.Invoker.invokeTestMethods(Invoker.java:1131)
        at org.testng.internal.TestMethodWorker.invokeTestMethods(TestMethodWorker.java:125)
        at org.testng.internal.TestMethodWorker.run(TestMethodWorker.java:108)
        at org.testng.TestRunner.privateRun(TestRunner.java:773)
        at org.testng.TestRunner.run(TestRunner.java:623)
        at org.testng.SuiteRunner.runTest(SuiteRunner.java:357)
        at org.testng.SuiteRunner.runSequentially(SuiteRunner.java:352)
        at org.testng.SuiteRunner.privateRun(SuiteRunner.java:310)
        at org.testng.SuiteRunner.run(SuiteRunner.java:259)
        at org.testng.SuiteRunnerWorker.runSuite(SuiteRunnerWorker.java:52)
        at org.testng.SuiteRunnerWorker.run(SuiteRunnerWorker.java:86)
        at org.testng.TestNG.runSuitesSequentially(TestNG.java:1185)
        at org.testng.TestNG.runSuitesLocally(TestNG.java:1110)
        at org.testng.TestNG.run(TestNG.java:1018)
        at com.sun.javatest.regtest.agent.TestNGRunner.main(TestNGRunner.java:94)
        at com.sun.javatest.regtest.agent.TestNGRunner.main(TestNGRunner.java:54)
        at java.base/jdk.internal.reflect.NativeMethodAccessorImpl.invoke0(Native Method)
        at java.base/jdk.internal.reflect.NativeMethodAccessorImpl.invoke(NativeMethodAccessorImpl.java:64)
        at java.base/jdk.internal.reflect.DelegatingMethodAccessorImpl.invoke(DelegatingMethodAccessorImpl.java:43)
        at java.base/java.lang.reflect.Method.invoke(Method.java:564)
        at com.sun.javatest.regtest.agent.MainWrapper$MainThread.run(MainWrapper.java:127)
        at java.base/java.lang.Thread.run(Thread.java:832)
        test TimeZoneNamesTest.test_tzNames("America/Punta_Arenas", en_US, "Punta Arenas Standard Time", "GMT-03:00", "Punta Arenas Daylight Time", "GMT-03:00", "Punta Arenas Time", "GMT-03:00"): failure
        java.lang.AssertionError: expected [GMT-03:00] but found [GMT]
        at org.testng.Assert.fail(Assert.java:94)
        at org.testng.Assert.failNotEquals(Assert.java:496)
        at org.testng.Assert.assertEquals(Assert.java:125)
        at org.testng.Assert.assertEquals(Assert.java:178)
        at org.testng.Assert.assertEquals(Assert.java:188)
        at TimeZoneNamesTest.test_tzNames(TimeZoneNamesTest.java:185)
        at java.base/jdk.internal.reflect.NativeMethodAccessorImpl.invoke0(Native Method)
        at java.base/jdk.internal.reflect.NativeMethodAccessorImpl.invoke(NativeMethodAccessorImpl.java:64)
        at java.base/jdk.internal.reflect.DelegatingMethodAccessorImpl.invoke(DelegatingMethodAccessorImpl.java:43)
        at java.base/java.lang.reflect.Method.invoke(Method.java:564)
        at org.testng.internal.MethodInvocationHelper.invokeMethod(MethodInvocationHelper.java:85)
        at org.testng.internal.Invoker.invokeMethod(Invoker.java:639)
        at org.testng.internal.Invoker.invokeTestMethod(Invoker.java:821)
        at org.testng.internal.Invoker.invokeTestMethods(Invoker.java:1131)
        at org.testng.internal.TestMethodWorker.invokeTestMethods(TestMethodWorker.java:125)
        at org.testng.internal.TestMethodWorker.run(TestMethodWorker.java:108)
        at org.testng.TestRunner.privateRun(TestRunner.java:773)
        at org.testng.TestRunner.run(TestRunner.java:623)
        at org.testng.SuiteRunner.runTest(SuiteRunner.java:357)
        at org.testng.SuiteRunner.runSequentially(SuiteRunner.java:352)
        at org.testng.SuiteRunner.privateRun(SuiteRunner.java:310)
        at org.testng.SuiteRunner.run(SuiteRunner.java:259)
        at org.testng.SuiteRunnerWorker.runSuite(SuiteRunnerWorker.java:52)
        at org.testng.SuiteRunnerWorker.run(SuiteRunnerWorker.java:86)
        at org.testng.TestNG.runSuitesSequentially(TestNG.java:1185)
        at org.testng.TestNG.runSuitesLocally(TestNG.java:1110)
        at org.testng.TestNG.run(TestNG.java:1018)
        at com.sun.javatest.regtest.agent.TestNGRunner.main(TestNGRunner.java:94)
        at com.sun.javatest.regtest.agent.TestNGRunner.main(TestNGRunner.java:54)
        at java.base/jdk.internal.reflect.NativeMethodAccessorImpl.invoke0(Native Method)
        at java.base/jdk.internal.reflect.NativeMethodAccessorImpl.invoke(NativeMethodAccessorImpl.java:64)
        at java.base/jdk.internal.reflect.DelegatingMethodAccessorImpl.invoke(DelegatingMethodAccessorImpl.java:43)
        at java.base/java.lang.reflect.Method.invoke(Method.java:564)
        at com.sun.javatest.regtest.agent.MainWrapper$MainThread.run(MainWrapper.java:127)
        at java.base/java.lang.Thread.run(Thread.java:832)
        test TimeZoneNamesTest.test_tzNames("America/Punta_Arenas", fr_FR, "Punta Arenas (heure standard)", "UTC−03:00", "Punta Arenas (heure d’été)", "UTC−03:00", "heure : Punta Arenas", "UTC−03:00"): failure
        java.lang.AssertionError: expected [UTC−03:00] but found [UTC]
        at org.testng.Assert.fail(Assert.java:94)
        at org.testng.Assert.failNotEquals(Assert.java:496)
        at org.testng.Assert.assertEquals(Assert.java:125)
        at org.testng.Assert.assertEquals(Assert.java:178)
        at org.testng.Assert.assertEquals(Assert.java:188)
        at TimeZoneNamesTest.test_tzNames(TimeZoneNamesTest.java:185)
        at java.base/jdk.internal.reflect.NativeMethodAccessorImpl.invoke0(Native Method)
        at java.base/jdk.internal.reflect.NativeMethodAccessorImpl.invoke(NativeMethodAccessorImpl.java:64)
        at java.base/jdk.internal.reflect.DelegatingMethodAccessorImpl.invoke(DelegatingMethodAccessorImpl.java:43)
        at java.base/java.lang.reflect.Method.invoke(Method.java:564)
        at org.testng.internal.MethodInvocationHelper.invokeMethod(MethodInvocationHelper.java:85)
        at org.testng.internal.Invoker.invokeMethod(Invoker.java:639)
        at org.testng.internal.Invoker.invokeTestMethod(Invoker.java:821)
        at org.testng.internal.Invoker.invokeTestMethods(Invoker.java:1131)
        at org.testng.internal.TestMethodWorker.invokeTestMethods(TestMethodWorker.java:125)
        at org.testng.internal.TestMethodWorker.run(TestMethodWorker.java:108)
        at org.testng.TestRunner.privateRun(TestRunner.java:773)
        at org.testng.TestRunner.run(TestRunner.java:623)
        at org.testng.SuiteRunner.runTest(SuiteRunner.java:357)
        at org.testng.SuiteRunner.runSequentially(SuiteRunner.java:352)
        at org.testng.SuiteRunner.privateRun(SuiteRunner.java:310)
        at org.testng.SuiteRunner.run(SuiteRunner.java:259)
        at org.testng.SuiteRunnerWorker.runSuite(SuiteRunnerWorker.java:52)
        at org.testng.SuiteRunnerWorker.run(SuiteRunnerWorker.java:86)
        at org.testng.TestNG.runSuitesSequentially(TestNG.java:1185)
        at org.testng.TestNG.runSuitesLocally(TestNG.java:1110)
        at org.testng.TestNG.run(TestNG.java:1018)
        at com.sun.javatest.regtest.agent.TestNGRunner.main(TestNGRunner.java:94)
        at com.sun.javatest.regtest.agent.TestNGRunner.main(TestNGRunner.java:54)
        at java.base/jdk.internal.reflect.NativeMethodAccessorImpl.invoke0(Native Method)
        at java.base/jdk.internal.reflect.NativeMethodAccessorImpl.invoke(NativeMethodAccessorImpl.java:64)
        at java.base/jdk.internal.reflect.DelegatingMethodAccessorImpl.invoke(DelegatingMethodAccessorImpl.java:43)
        at java.base/java.lang.reflect.Method.invoke(Method.java:564)
        at com.sun.javatest.regtest.agent.MainWrapper$MainThread.run(MainWrapper.java:127)
        at java.base/java.lang.Thread.run(Thread.java:832)
        test TimeZoneNamesTest.test_tzNames("Asia/Famagusta", en_US, "Famagusta Standard Time", "GMT+02:00", "Famagusta Daylight Time", "GMT+03:00", "Famagusta Time", "GMT+02:00"): failure
        java.lang.AssertionError: expected [GMT+02:00] but found [GMT]
        at org.testng.Assert.fail(Assert.java:94)
        at org.testng.Assert.failNotEquals(Assert.java:496)
        at org.testng.Assert.assertEquals(Assert.java:125)
        at org.testng.Assert.assertEquals(Assert.java:178)
        at org.testng.Assert.assertEquals(Assert.java:188)
        at TimeZoneNamesTest.test_tzNames(TimeZoneNamesTest.java:185)
        at java.base/jdk.internal.reflect.NativeMethodAccessorImpl.invoke0(Native Method)
        at java.base/jdk.internal.reflect.NativeMethodAccessorImpl.invoke(NativeMethodAccessorImpl.java:64)
        at java.base/jdk.internal.reflect.DelegatingMethodAccessorImpl.invoke(DelegatingMethodAccessorImpl.java:43)
        at java.base/java.lang.reflect.Method.invoke(Method.java:564)
        at org.testng.internal.MethodInvocationHelper.invokeMethod(MethodInvocationHelper.java:85)
        at org.testng.internal.Invoker.invokeMethod(Invoker.java:639)
        at org.testng.internal.Invoker.invokeTestMethod(Invoker.java:821)
        at org.testng.internal.Invoker.invokeTestMethods(Invoker.java:1131)
        at org.testng.internal.TestMethodWorker.invokeTestMethods(TestMethodWorker.java:125)
        at org.testng.internal.TestMethodWorker.run(TestMethodWorker.java:108)
        at org.testng.TestRunner.privateRun(TestRunner.java:773)
        at org.testng.TestRunner.run(TestRunner.java:623)
        at org.testng.SuiteRunner.runTest(SuiteRunner.java:357)
        at org.testng.SuiteRunner.runSequentially(SuiteRunner.java:352)
        at org.testng.SuiteRunner.privateRun(SuiteRunner.java:310)
        at org.testng.SuiteRunner.run(SuiteRunner.java:259)
        at org.testng.SuiteRunnerWorker.runSuite(SuiteRunnerWorker.java:52)
        at org.testng.SuiteRunnerWorker.run(SuiteRunnerWorker.java:86)
        at org.testng.TestNG.runSuitesSequentially(TestNG.java:1185)
        at org.testng.TestNG.runSuitesLocally(TestNG.java:1110)
        at org.testng.TestNG.run(TestNG.java:1018)
        at com.sun.javatest.regtest.agent.TestNGRunner.main(TestNGRunner.java:94)
        at com.sun.javatest.regtest.agent.TestNGRunner.main(TestNGRunner.java:54)
        at java.base/jdk.internal.reflect.NativeMethodAccessorImpl.invoke0(Native Method)
        at java.base/jdk.internal.reflect.NativeMethodAccessorImpl.invoke(NativeMethodAccessorImpl.java:64)
        at java.base/jdk.internal.reflect.DelegatingMethodAccessorImpl.invoke(DelegatingMethodAccessorImpl.java:43)
        at java.base/java.lang.reflect.Method.invoke(Method.java:564)
        at com.sun.javatest.regtest.agent.MainWrapper$MainThread.run(MainWrapper.java:127)
        at java.base/java.lang.Thread.run(Thread.java:832)
        test TimeZoneNamesTest.test_tzNames("Asia/Famagusta", fr_FR, "Famagouste (heure standard)", "UTC+02:00", "Famagouste (heure d’été)", "UTC+03:00", "heure : Famagouste", "UTC+02:00"): failure
        java.lang.AssertionError: expected [UTC+02:00] but found [UTC]
        at org.testng.Assert.fail(Assert.java:94)
        at org.testng.Assert.failNotEquals(Assert.java:496)
        at org.testng.Assert.assertEquals(Assert.java:125)
        at org.testng.Assert.assertEquals(Assert.java:178)
        at org.testng.Assert.assertEquals(Assert.java:188)
        at TimeZoneNamesTest.test_tzNames(TimeZoneNamesTest.java:185)
        at java.base/jdk.internal.reflect.NativeMethodAccessorImpl.invoke0(Native Method)
        at java.base/jdk.internal.reflect.NativeMethodAccessorImpl.invoke(NativeMethodAccessorImpl.java:64)
        at java.base/jdk.internal.reflect.DelegatingMethodAccessorImpl.invoke(DelegatingMethodAccessorImpl.java:43)
        at java.base/java.lang.reflect.Method.invoke(Method.java:564)
        at org.testng.internal.MethodInvocationHelper.invokeMethod(MethodInvocationHelper.java:85)
        at org.testng.internal.Invoker.invokeMethod(Invoker.java:639)
        at org.testng.internal.Invoker.invokeTestMethod(Invoker.java:821)
        at org.testng.internal.Invoker.invokeTestMethods(Invoker.java:1131)
        at org.testng.internal.TestMethodWorker.invokeTestMethods(TestMethodWorker.java:125)
        at org.testng.internal.TestMethodWorker.run(TestMethodWorker.java:108)
        at org.testng.TestRunner.privateRun(TestRunner.java:773)
        at org.testng.TestRunner.run(TestRunner.java:623)
        at org.testng.SuiteRunner.runTest(SuiteRunner.java:357)
        at org.testng.SuiteRunner.runSequentially(SuiteRunner.java:352)
        at org.testng.SuiteRunner.privateRun(SuiteRunner.java:310)
        at org.testng.SuiteRunner.run(SuiteRunner.java:259)
        at org.testng.SuiteRunnerWorker.runSuite(SuiteRunnerWorker.java:52)
        at org.testng.SuiteRunnerWorker.run(SuiteRunnerWorker.java:86)
        at org.testng.TestNG.runSuitesSequentially(TestNG.java:1185)
        at org.testng.TestNG.runSuitesLocally(TestNG.java:1110)
        at org.testng.TestNG.run(TestNG.java:1018)
        at com.sun.javatest.regtest.agent.TestNGRunner.main(TestNGRunner.java:94)
        at com.sun.javatest.regtest.agent.TestNGRunner.main(TestNGRunner.java:54)
        at java.base/jdk.internal.reflect.NativeMethodAccessorImpl.invoke0(Native Method)
        at java.base/jdk.internal.reflect.NativeMethodAccessorImpl.invoke(NativeMethodAccessorImpl.java:64)
        at java.base/jdk.internal.reflect.DelegatingMethodAccessorImpl.invoke(DelegatingMethodAccessorImpl.java:43)
        at java.base/java.lang.reflect.Method.invoke(Method.java:564)
        at com.sun.javatest.regtest.agent.MainWrapper$MainThread.run(MainWrapper.java:127)
        at java.base/java.lang.Thread.run(Thread.java:832)
        test TimeZoneNamesTest.test_tzNames("Europe/Astrakhan", en_US, "Astrakhan Standard Time", "GMT+04:00", "Astrakhan Daylight Time", "GMT+04:00", "Astrakhan Time", "GMT+04:00"): failure
        java.lang.AssertionError: expected [GMT+04:00] but found [GMT]
        at org.testng.Assert.fail(Assert.java:94)
        at org.testng.Assert.failNotEquals(Assert.java:496)
        at org.testng.Assert.assertEquals(Assert.java:125)
        at org.testng.Assert.assertEquals(Assert.java:178)
        at org.testng.Assert.assertEquals(Assert.java:188)
        at TimeZoneNamesTest.test_tzNames(TimeZoneNamesTest.java:185)
        at java.base/jdk.internal.reflect.NativeMethodAccessorImpl.invoke0(Native Method)
        at java.base/jdk.internal.reflect.NativeMethodAccessorImpl.invoke(NativeMethodAccessorImpl.java:64)
        at java.base/jdk.internal.reflect.DelegatingMethodAccessorImpl.invoke(DelegatingMethodAccessorImpl.java:43)
        at java.base/java.lang.reflect.Method.invoke(Method.java:564)
        at org.testng.internal.MethodInvocationHelper.invokeMethod(MethodInvocationHelper.java:85)
        at org.testng.internal.Invoker.invokeMethod(Invoker.java:639)
        at org.testng.internal.Invoker.invokeTestMethod(Invoker.java:821)
        at org.testng.internal.Invoker.invokeTestMethods(Invoker.java:1131)
        at org.testng.internal.TestMethodWorker.invokeTestMethods(TestMethodWorker.java:125)
        at org.testng.internal.TestMethodWorker.run(TestMethodWorker.java:108)
        at org.testng.TestRunner.privateRun(TestRunner.java:773)
        at org.testng.TestRunner.run(TestRunner.java:623)
        at org.testng.SuiteRunner.runTest(SuiteRunner.java:357)
        at org.testng.SuiteRunner.runSequentially(SuiteRunner.java:352)
        at org.testng.SuiteRunner.privateRun(SuiteRunner.java:310)
        at org.testng.SuiteRunner.run(SuiteRunner.java:259)
        at org.testng.SuiteRunnerWorker.runSuite(SuiteRunnerWorker.java:52)
        at org.testng.SuiteRunnerWorker.run(SuiteRunnerWorker.java:86)
        at org.testng.TestNG.runSuitesSequentially(TestNG.java:1185)
        at org.testng.TestNG.runSuitesLocally(TestNG.java:1110)
        at org.testng.TestNG.run(TestNG.java:1018)
        at com.sun.javatest.regtest.agent.TestNGRunner.main(TestNGRunner.java:94)
        at com.sun.javatest.regtest.agent.TestNGRunner.main(TestNGRunner.java:54)
        at java.base/jdk.internal.reflect.NativeMethodAccessorImpl.invoke0(Native Method)
        at java.base/jdk.internal.reflect.NativeMethodAccessorImpl.invoke(NativeMethodAccessorImpl.java:64)
        at java.base/jdk.internal.reflect.DelegatingMethodAccessorImpl.invoke(DelegatingMethodAccessorImpl.java:43)
        at java.base/java.lang.reflect.Method.invoke(Method.java:564)
        at com.sun.javatest.regtest.agent.MainWrapper$MainThread.run(MainWrapper.java:127)
        at java.base/java.lang.Thread.run(Thread.java:832)
        test TimeZoneNamesTest.test_tzNames("Europe/Astrakhan", fr_FR, "Astrakhan (heure standard)", "UTC+04:00", "Astrakhan (heure d’été)", "UTC+04:00", "heure : Astrakhan", "UTC+04:00"): failure
        java.lang.AssertionError: expected [UTC+04:00] but found [UTC]
        at org.testng.Assert.fail(Assert.java:94)
        at org.testng.Assert.failNotEquals(Assert.java:496)
        at org.testng.Assert.assertEquals(Assert.java:125)
        at org.testng.Assert.assertEquals(Assert.java:178)
        at org.testng.Assert.assertEquals(Assert.java:188)
        at TimeZoneNamesTest.test_tzNames(TimeZoneNamesTest.java:185)
        at java.base/jdk.internal.reflect.NativeMethodAccessorImpl.invoke0(Native Method)
        at java.base/jdk.internal.reflect.NativeMethodAccessorImpl.invoke(NativeMethodAccessorImpl.java:64)
        at java.base/jdk.internal.reflect.DelegatingMethodAccessorImpl.invoke(DelegatingMethodAccessorImpl.java:43)
        at java.base/java.lang.reflect.Method.invoke(Method.java:564)
        at org.testng.internal.MethodInvocationHelper.invokeMethod(MethodInvocationHelper.java:85)
        at org.testng.internal.Invoker.invokeMethod(Invoker.java:639)
        at org.testng.internal.Invoker.invokeTestMethod(Invoker.java:821)
        at org.testng.internal.Invoker.invokeTestMethods(Invoker.java:1131)
        at org.testng.internal.TestMethodWorker.invokeTestMethods(TestMethodWorker.java:125)
        at org.testng.internal.TestMethodWorker.run(TestMethodWorker.java:108)
        at org.testng.TestRunner.privateRun(TestRunner.java:773)
        at org.testng.TestRunner.run(TestRunner.java:623)
        at org.testng.SuiteRunner.runTest(SuiteRunner.java:357)
        at org.testng.SuiteRunner.runSequentially(SuiteRunner.java:352)
        at org.testng.SuiteRunner.privateRun(SuiteRunner.java:310)
        at org.testng.SuiteRunner.run(SuiteRunner.java:259)
        at org.testng.SuiteRunnerWorker.runSuite(SuiteRunnerWorker.java:52)
        at org.testng.SuiteRunnerWorker.run(SuiteRunnerWorker.java:86)
        at org.testng.TestNG.runSuitesSequentially(TestNG.java:1185)
        at org.testng.TestNG.runSuitesLocally(TestNG.java:1110)
        at org.testng.TestNG.run(TestNG.java:1018)
        at com.sun.javatest.regtest.agent.TestNGRunner.main(TestNGRunner.java:94)
        at com.sun.javatest.regtest.agent.TestNGRunner.main(TestNGRunner.java:54)
        at java.base/jdk.internal.reflect.NativeMethodAccessorImpl.invoke0(Native Method)
        at java.base/jdk.internal.reflect.NativeMethodAccessorImpl.invoke(NativeMethodAccessorImpl.java:64)
        at java.base/jdk.internal.reflect.DelegatingMethodAccessorImpl.invoke(DelegatingMethodAccessorImpl.java:43)
        at java.base/java.lang.reflect.Method.invoke(Method.java:564)
        at com.sun.javatest.regtest.agent.MainWrapper$MainThread.run(MainWrapper.java:127)
        at java.base/java.lang.Thread.run(Thread.java:832)
        test TimeZoneNamesTest.test_tzNames("Europe/Saratov", en_US, "Saratov Standard Time", "GMT+04:00", "Saratov Daylight Time", "GMT+04:00", "Saratov Time", "GMT+04:00"): failure
        java.lang.AssertionError: expected [GMT+04:00] but found [GMT]
        at org.testng.Assert.fail(Assert.java:94)
        at org.testng.Assert.failNotEquals(Assert.java:496)
        at org.testng.Assert.assertEquals(Assert.java:125)
        at org.testng.Assert.assertEquals(Assert.java:178)
        at org.testng.Assert.assertEquals(Assert.java:188)
        at TimeZoneNamesTest.test_tzNames(TimeZoneNamesTest.java:185)
        at java.base/jdk.internal.reflect.NativeMethodAccessorImpl.invoke0(Native Method)
        at java.base/jdk.internal.reflect.NativeMethodAccessorImpl.invoke(NativeMethodAccessorImpl.java:64)
        at java.base/jdk.internal.reflect.DelegatingMethodAccessorImpl.invoke(DelegatingMethodAccessorImpl.java:43)
        at java.base/java.lang.reflect.Method.invoke(Method.java:564)
        at org.testng.internal.MethodInvocationHelper.invokeMethod(MethodInvocationHelper.java:85)
        at org.testng.internal.Invoker.invokeMethod(Invoker.java:639)
        at org.testng.internal.Invoker.invokeTestMethod(Invoker.java:821)
        at org.testng.internal.Invoker.invokeTestMethods(Invoker.java:1131)
        at org.testng.internal.TestMethodWorker.invokeTestMethods(TestMethodWorker.java:125)
        at org.testng.internal.TestMethodWorker.run(TestMethodWorker.java:108)
        at org.testng.TestRunner.privateRun(TestRunner.java:773)
        at org.testng.TestRunner.run(TestRunner.java:623)
        at org.testng.SuiteRunner.runTest(SuiteRunner.java:357)
        at org.testng.SuiteRunner.runSequentially(SuiteRunner.java:352)
        at org.testng.SuiteRunner.privateRun(SuiteRunner.java:310)
        at org.testng.SuiteRunner.run(SuiteRunner.java:259)
        at org.testng.SuiteRunnerWorker.runSuite(SuiteRunnerWorker.java:52)
        at org.testng.SuiteRunnerWorker.run(SuiteRunnerWorker.java:86)
        at org.testng.TestNG.runSuitesSequentially(TestNG.java:1185)
        at org.testng.TestNG.runSuitesLocally(TestNG.java:1110)
        at org.testng.TestNG.run(TestNG.java:1018)
        at com.sun.javatest.regtest.agent.TestNGRunner.main(TestNGRunner.java:94)
        at com.sun.javatest.regtest.agent.TestNGRunner.main(TestNGRunner.java:54)
        at java.base/jdk.internal.reflect.NativeMethodAccessorImpl.invoke0(Native Method)
        at java.base/jdk.internal.reflect.NativeMethodAccessorImpl.invoke(NativeMethodAccessorImpl.java:64)
        at java.base/jdk.internal.reflect.DelegatingMethodAccessorImpl.invoke(DelegatingMethodAccessorImpl.java:43)
        at java.base/java.lang.reflect.Method.invoke(Method.java:564)
        at com.sun.javatest.regtest.agent.MainWrapper$MainThread.run(MainWrapper.java:127)
        at java.base/java.lang.Thread.run(Thread.java:832)
        test TimeZoneNamesTest.test_tzNames("Europe/Saratov", fr_FR, "Saratov (heure standard)", "UTC+04:00", "Saratov (heure d’été)", "UTC+04:00", "heure : Saratov", "UTC+04:00"): failure
        java.lang.AssertionError: expected [UTC+04:00] but found [UTC]
        at org.testng.Assert.fail(Assert.java:94)
        at org.testng.Assert.failNotEquals(Assert.java:496)
        at org.testng.Assert.assertEquals(Assert.java:125)
        at org.testng.Assert.assertEquals(Assert.java:178)
        at org.testng.Assert.assertEquals(Assert.java:188)
        at TimeZoneNamesTest.test_tzNames(TimeZoneNamesTest.java:185)
        at java.base/jdk.internal.reflect.NativeMethodAccessorImpl.invoke0(Native Method)
        at java.base/jdk.internal.reflect.NativeMethodAccessorImpl.invoke(NativeMethodAccessorImpl.java:64)
        at java.base/jdk.internal.reflect.DelegatingMethodAccessorImpl.invoke(DelegatingMethodAccessorImpl.java:43)
        at java.base/java.lang.reflect.Method.invoke(Method.java:564)
        at org.testng.internal.MethodInvocationHelper.invokeMethod(MethodInvocationHelper.java:85)
        at org.testng.internal.Invoker.invokeMethod(Invoker.java:639)
        at org.testng.internal.Invoker.invokeTestMethod(Invoker.java:821)
        at org.testng.internal.Invoker.invokeTestMethods(Invoker.java:1131)
        at org.testng.internal.TestMethodWorker.invokeTestMethods(TestMethodWorker.java:125)
        at org.testng.internal.TestMethodWorker.run(TestMethodWorker.java:108)
        at org.testng.TestRunner.privateRun(TestRunner.java:773)
        at org.testng.TestRunner.run(TestRunner.java:623)
        at org.testng.SuiteRunner.runTest(SuiteRunner.java:357)
        at org.testng.SuiteRunner.runSequentially(SuiteRunner.java:352)
        at org.testng.SuiteRunner.privateRun(SuiteRunner.java:310)
        at org.testng.SuiteRunner.run(SuiteRunner.java:259)
        at org.testng.SuiteRunnerWorker.runSuite(SuiteRunnerWorker.java:52)
        at org.testng.SuiteRunnerWorker.run(SuiteRunnerWorker.java:86)
        at org.testng.TestNG.runSuitesSequentially(TestNG.java:1185)
        at org.testng.TestNG.runSuitesLocally(TestNG.java:1110)
        at org.testng.TestNG.run(TestNG.java:1018)
        at com.sun.javatest.regtest.agent.TestNGRunner.main(TestNGRunner.java:94)
        at com.sun.javatest.regtest.agent.TestNGRunner.main(TestNGRunner.java:54)
        at java.base/jdk.internal.reflect.NativeMethodAccessorImpl.invoke0(Native Method)
        at java.base/jdk.internal.reflect.NativeMethodAccessorImpl.invoke(NativeMethodAccessorImpl.java:64)
        at java.base/jdk.internal.reflect.DelegatingMethodAccessorImpl.invoke(DelegatingMethodAccessorImpl.java:43)
        at java.base/java.lang.reflect.Method.invoke(Method.java:564)
        at com.sun.javatest.regtest.agent.MainWrapper$MainThread.run(MainWrapper.java:127)
        at java.base/java.lang.Thread.run(Thread.java:832)
        test TimeZoneNamesTest.test_tzNames("Europe/Ulyanovsk", en_US, "Ulyanovsk Standard Time", "GMT+04:00", "Ulyanovsk Daylight Time", "GMT+04:00", "Ulyanovsk Time", "GMT+04:00"): failure
        java.lang.AssertionError: expected [GMT+04:00] but found [GMT]
        at org.testng.Assert.fail(Assert.java:94)
        at org.testng.Assert.failNotEquals(Assert.java:496)
        at org.testng.Assert.assertEquals(Assert.java:125)
        at org.testng.Assert.assertEquals(Assert.java:178)
        at org.testng.Assert.assertEquals(Assert.java:188)
        at TimeZoneNamesTest.test_tzNames(TimeZoneNamesTest.java:185)
        at java.base/jdk.internal.reflect.NativeMethodAccessorImpl.invoke0(Native Method)
        at java.base/jdk.internal.reflect.NativeMethodAccessorImpl.invoke(NativeMethodAccessorImpl.java:64)
        at java.base/jdk.internal.reflect.DelegatingMethodAccessorImpl.invoke(DelegatingMethodAccessorImpl.java:43)
        at java.base/java.lang.reflect.Method.invoke(Method.java:564)
        at org.testng.internal.MethodInvocationHelper.invokeMethod(MethodInvocationHelper.java:85)
        at org.testng.internal.Invoker.invokeMethod(Invoker.java:639)
        at org.testng.internal.Invoker.invokeTestMethod(Invoker.java:821)
        at org.testng.internal.Invoker.invokeTestMethods(Invoker.java:1131)
        at org.testng.internal.TestMethodWorker.invokeTestMethods(TestMethodWorker.java:125)
        at org.testng.internal.TestMethodWorker.run(TestMethodWorker.java:108)
        at org.testng.TestRunner.privateRun(TestRunner.java:773)
        at org.testng.TestRunner.run(TestRunner.java:623)
        at org.testng.SuiteRunner.runTest(SuiteRunner.java:357)
        at org.testng.SuiteRunner.runSequentially(SuiteRunner.java:352)
        at org.testng.SuiteRunner.privateRun(SuiteRunner.java:310)
        at org.testng.SuiteRunner.run(SuiteRunner.java:259)
        at org.testng.SuiteRunnerWorker.runSuite(SuiteRunnerWorker.java:52)
        at org.testng.SuiteRunnerWorker.run(SuiteRunnerWorker.java:86)
        at org.testng.TestNG.runSuitesSequentially(TestNG.java:1185)
        at org.testng.TestNG.runSuitesLocally(TestNG.java:1110)
        at org.testng.TestNG.run(TestNG.java:1018)
        at com.sun.javatest.regtest.agent.TestNGRunner.main(TestNGRunner.java:94)
        at com.sun.javatest.regtest.agent.TestNGRunner.main(TestNGRunner.java:54)
        at java.base/jdk.internal.reflect.NativeMethodAccessorImpl.invoke0(Native Method)
        at java.base/jdk.internal.reflect.NativeMethodAccessorImpl.invoke(NativeMethodAccessorImpl.java:64)
        at java.base/jdk.internal.reflect.DelegatingMethodAccessorImpl.invoke(DelegatingMethodAccessorImpl.java:43)
        at java.base/java.lang.reflect.Method.invoke(Method.java:564)
        at com.sun.javatest.regtest.agent.MainWrapper$MainThread.run(MainWrapper.java:127)
        at java.base/java.lang.Thread.run(Thread.java:832)
        test TimeZoneNamesTest.test_tzNames("Europe/Ulyanovsk", fr_FR, "Oulianovsk (heure standard)", "UTC+04:00", "Oulianovsk (heure d’été)", "UTC+04:00", "heure : Oulianovsk", "UTC+04:00"): failure
        java.lang.AssertionError: expected [UTC+04:00] but found [UTC]
        at org.testng.Assert.fail(Assert.java:94)
        at org.testng.Assert.failNotEquals(Assert.java:496)
        at org.testng.Assert.assertEquals(Assert.java:125)
        at org.testng.Assert.assertEquals(Assert.java:178)
        at org.testng.Assert.assertEquals(Assert.java:188)
        at TimeZoneNamesTest.test_tzNames(TimeZoneNamesTest.java:185)
        at java.base/jdk.internal.reflect.NativeMethodAccessorImpl.invoke0(Native Method)
        at java.base/jdk.internal.reflect.NativeMethodAccessorImpl.invoke(NativeMethodAccessorImpl.java:64)
        at java.base/jdk.internal.reflect.DelegatingMethodAccessorImpl.invoke(DelegatingMethodAccessorImpl.java:43)
        at java.base/java.lang.reflect.Method.invoke(Method.java:564)
        at org.testng.internal.MethodInvocationHelper.invokeMethod(MethodInvocationHelper.java:85)
        at org.testng.internal.Invoker.invokeMethod(Invoker.java:639)
        at org.testng.internal.Invoker.invokeTestMethod(Invoker.java:821)
        at org.testng.internal.Invoker.invokeTestMethods(Invoker.java:1131)
        at org.testng.internal.TestMethodWorker.invokeTestMethods(TestMethodWorker.java:125)
        at org.testng.internal.TestMethodWorker.run(TestMethodWorker.java:108)
        at org.testng.TestRunner.privateRun(TestRunner.java:773)
        at org.testng.TestRunner.run(TestRunner.java:623)
        at org.testng.SuiteRunner.runTest(SuiteRunner.java:357)
        at org.testng.SuiteRunner.runSequentially(SuiteRunner.java:352)
        at org.testng.SuiteRunner.privateRun(SuiteRunner.java:310)
        at org.testng.SuiteRunner.run(SuiteRunner.java:259)
        at org.testng.SuiteRunnerWorker.runSuite(SuiteRunnerWorker.java:52)
        at org.testng.SuiteRunnerWorker.run(SuiteRunnerWorker.java:86)
        at org.testng.TestNG.runSuitesSequentially(TestNG.java:1185)
        at org.testng.TestNG.runSuitesLocally(TestNG.java:1110)
        at org.testng.TestNG.run(TestNG.java:1018)
        at com.sun.javatest.regtest.agent.TestNGRunner.main(TestNGRunner.java:94)
        at com.sun.javatest.regtest.agent.TestNGRunner.main(TestNGRunner.java:54)
        at java.base/jdk.internal.reflect.NativeMethodAccessorImpl.invoke0(Native Method)
        at java.base/jdk.internal.reflect.NativeMethodAccessorImpl.invoke(NativeMethodAccessorImpl.java:64)
        at java.base/jdk.internal.reflect.DelegatingMethodAccessorImpl.invoke(DelegatingMethodAccessorImpl.java:43)
        at java.base/java.lang.reflect.Method.invoke(Method.java:564)
        at com.sun.javatest.regtest.agent.MainWrapper$MainThread.run(MainWrapper.java:127)
        at java.base/java.lang.Thread.run(Thread.java:832)
        test TimeZoneNamesTest.test_tzNames("Pacific/Bougainville", en_US, "Bougainville Standard Time", "GMT+11:00", "Bougainville Daylight Time", "GMT+11:00", "Bougainville Time", "GMT+11:00"): failure
        java.lang.AssertionError: expected [GMT+11:00] but found [GMT]
        at org.testng.Assert.fail(Assert.java:94)
        at org.testng.Assert.failNotEquals(Assert.java:496)
        at org.testng.Assert.assertEquals(Assert.java:125)
        at org.testng.Assert.assertEquals(Assert.java:178)
        at org.testng.Assert.assertEquals(Assert.java:188)
        at TimeZoneNamesTest.test_tzNames(TimeZoneNamesTest.java:185)
        at java.base/jdk.internal.reflect.NativeMethodAccessorImpl.invoke0(Native Method)
        at java.base/jdk.internal.reflect.NativeMethodAccessorImpl.invoke(NativeMethodAccessorImpl.java:64)
        at java.base/jdk.internal.reflect.DelegatingMethodAccessorImpl.invoke(DelegatingMethodAccessorImpl.java:43)
        at java.base/java.lang.reflect.Method.invoke(Method.java:564)
        at org.testng.internal.MethodInvocationHelper.invokeMethod(MethodInvocationHelper.java:85)
        at org.testng.internal.Invoker.invokeMethod(Invoker.java:639)
        at org.testng.internal.Invoker.invokeTestMethod(Invoker.java:821)
        at org.testng.internal.Invoker.invokeTestMethods(Invoker.java:1131)
        at org.testng.internal.TestMethodWorker.invokeTestMethods(TestMethodWorker.java:125)
        at org.testng.internal.TestMethodWorker.run(TestMethodWorker.java:108)
        at org.testng.TestRunner.privateRun(TestRunner.java:773)
        at org.testng.TestRunner.run(TestRunner.java:623)
        at org.testng.SuiteRunner.runTest(SuiteRunner.java:357)
        at org.testng.SuiteRunner.runSequentially(SuiteRunner.java:352)
        at org.testng.SuiteRunner.privateRun(SuiteRunner.java:310)
        at org.testng.SuiteRunner.run(SuiteRunner.java:259)
        at org.testng.SuiteRunnerWorker.runSuite(SuiteRunnerWorker.java:52)
        at org.testng.SuiteRunnerWorker.run(SuiteRunnerWorker.java:86)
        at org.testng.TestNG.runSuitesSequentially(TestNG.java:1185)
        at org.testng.TestNG.runSuitesLocally(TestNG.java:1110)
        at org.testng.TestNG.run(TestNG.java:1018)
        at com.sun.javatest.regtest.agent.TestNGRunner.main(TestNGRunner.java:94)
        at com.sun.javatest.regtest.agent.TestNGRunner.main(TestNGRunner.java:54)
        at java.base/jdk.internal.reflect.NativeMethodAccessorImpl.invoke0(Native Method)
        at java.base/jdk.internal.reflect.NativeMethodAccessorImpl.invoke(NativeMethodAccessorImpl.java:64)
        at java.base/jdk.internal.reflect.DelegatingMethodAccessorImpl.invoke(DelegatingMethodAccessorImpl.java:43)
        at java.base/java.lang.reflect.Method.invoke(Method.java:564)
        at com.sun.javatest.regtest.agent.MainWrapper$MainThread.run(MainWrapper.java:127)
        at java.base/java.lang.Thread.run(Thread.java:832)
        test TimeZoneNamesTest.test_tzNames("Pacific/Bougainville", fr_FR, "Bougainville (heure standard)", "UTC+11:00", "Bougainville (heure d’été)", "UTC+11:00", "heure : Bougainville", "UTC+11:00"): failure
        java.lang.AssertionError: expected [UTC+11:00] but found [UTC]
        at org.testng.Assert.fail(Assert.java:94)
        at org.testng.Assert.failNotEquals(Assert.java:496)
        at org.testng.Assert.assertEquals(Assert.java:125)
        at org.testng.Assert.assertEquals(Assert.java:178)
        at org.testng.Assert.assertEquals(Assert.java:188)
        at TimeZoneNamesTest.test_tzNames(TimeZoneNamesTest.java:185)
        at java.base/jdk.internal.reflect.NativeMethodAccessorImpl.invoke0(Native Method)
        at java.base/jdk.internal.reflect.NativeMethodAccessorImpl.invoke(NativeMethodAccessorImpl.java:64)
        at java.base/jdk.internal.reflect.DelegatingMethodAccessorImpl.invoke(DelegatingMethodAccessorImpl.java:43)
        at java.base/java.lang.reflect.Method.invoke(Method.java:564)
        at org.testng.internal.MethodInvocationHelper.invokeMethod(MethodInvocationHelper.java:85)
        at org.testng.internal.Invoker.invokeMethod(Invoker.java:639)
        at org.testng.internal.Invoker.invokeTestMethod(Invoker.java:821)
        at org.testng.internal.Invoker.invokeTestMethods(Invoker.java:1131)
        at org.testng.internal.TestMethodWorker.invokeTestMethods(TestMethodWorker.java:125)
        at org.testng.internal.TestMethodWorker.run(TestMethodWorker.java:108)
        at org.testng.TestRunner.privateRun(TestRunner.java:773)
        at org.testng.TestRunner.run(TestRunner.java:623)
        at org.testng.SuiteRunner.runTest(SuiteRunner.java:357)
        at org.testng.SuiteRunner.runSequentially(SuiteRunner.java:352)
        at org.testng.SuiteRunner.privateRun(SuiteRunner.java:310)
        at org.testng.SuiteRunner.run(SuiteRunner.java:259)
        at org.testng.SuiteRunnerWorker.runSuite(SuiteRunnerWorker.java:52)
        at org.testng.SuiteRunnerWorker.run(SuiteRunnerWorker.java:86)
        at org.testng.TestNG.runSuitesSequentially(TestNG.java:1185)
        at org.testng.TestNG.runSuitesLocally(TestNG.java:1110)
        at org.testng.TestNG.run(TestNG.java:1018)
        at com.sun.javatest.regtest.agent.TestNGRunner.main(TestNGRunner.java:94)
        at com.sun.javatest.regtest.agent.TestNGRunner.main(TestNGRunner.java:54)
        at java.base/jdk.internal.reflect.NativeMethodAccessorImpl.invoke0(Native Method)
        at java.base/jdk.internal.reflect.NativeMethodAccessorImpl.invoke(NativeMethodAccessorImpl.java:64)
        at java.base/jdk.internal.reflect.DelegatingMethodAccessorImpl.invoke(DelegatingMethodAccessorImpl.java:43)
        at java.base/java.lang.reflect.Method.invoke(Method.java:564)
        at com.sun.javatest.regtest.agent.MainWrapper$MainThread.run(MainWrapper.java:127)
        at java.base/java.lang.Thread.run(Thread.java:832)
        test TimeZoneNamesTest.test_tzNames("Europe/Istanbul", en_US, "Istanbul Standard Time", "GMT+03:00", "Istanbul Daylight Time", "GMT+03:00", "Istanbul Time", "GMT+03:00"): failure
        java.lang.AssertionError: expected [GMT+03:00] but found [GMT]
        at org.testng.Assert.fail(Assert.java:94)
        at org.testng.Assert.failNotEquals(Assert.java:496)
        at org.testng.Assert.assertEquals(Assert.java:125)
        at org.testng.Assert.assertEquals(Assert.java:178)
        at org.testng.Assert.assertEquals(Assert.java:188)
        at TimeZoneNamesTest.test_tzNames(TimeZoneNamesTest.java:185)
        at java.base/jdk.internal.reflect.NativeMethodAccessorImpl.invoke0(Native Method)
        at java.base/jdk.internal.reflect.NativeMethodAccessorImpl.invoke(NativeMethodAccessorImpl.java:64)
        at java.base/jdk.internal.reflect.DelegatingMethodAccessorImpl.invoke(DelegatingMethodAccessorImpl.java:43)
        at java.base/java.lang.reflect.Method.invoke(Method.java:564)
        at org.testng.internal.MethodInvocationHelper.invokeMethod(MethodInvocationHelper.java:85)
        at org.testng.internal.Invoker.invokeMethod(Invoker.java:639)
        at org.testng.internal.Invoker.invokeTestMethod(Invoker.java:821)
        at org.testng.internal.Invoker.invokeTestMethods(Invoker.java:1131)
        at org.testng.internal.TestMethodWorker.invokeTestMethods(TestMethodWorker.java:125)
        at org.testng.internal.TestMethodWorker.run(TestMethodWorker.java:108)
        at org.testng.TestRunner.privateRun(TestRunner.java:773)
        at org.testng.TestRunner.run(TestRunner.java:623)
        at org.testng.SuiteRunner.runTest(SuiteRunner.java:357)
        at org.testng.SuiteRunner.runSequentially(SuiteRunner.java:352)
        at org.testng.SuiteRunner.privateRun(SuiteRunner.java:310)
        at org.testng.SuiteRunner.run(SuiteRunner.java:259)
        at org.testng.SuiteRunnerWorker.runSuite(SuiteRunnerWorker.java:52)
        at org.testng.SuiteRunnerWorker.run(SuiteRunnerWorker.java:86)
        at org.testng.TestNG.runSuitesSequentially(TestNG.java:1185)
        at org.testng.TestNG.runSuitesLocally(TestNG.java:1110)
        at org.testng.TestNG.run(TestNG.java:1018)
        at com.sun.javatest.regtest.agent.TestNGRunner.main(TestNGRunner.java:94)
        at com.sun.javatest.regtest.agent.TestNGRunner.main(TestNGRunner.java:54)
        at java.base/jdk.internal.reflect.NativeMethodAccessorImpl.invoke0(Native Method)
        at java.base/jdk.internal.reflect.NativeMethodAccessorImpl.invoke(NativeMethodAccessorImpl.java:64)
        at java.base/jdk.internal.reflect.DelegatingMethodAccessorImpl.invoke(DelegatingMethodAccessorImpl.java:43)
        at java.base/java.lang.reflect.Method.invoke(Method.java:564)
        at com.sun.javatest.regtest.agent.MainWrapper$MainThread.run(MainWrapper.java:127)
        at java.base/java.lang.Thread.run(Thread.java:832)
        test TimeZoneNamesTest.test_tzNames("Europe/Istanbul", fr_FR, "Istanbul (heure standard)", "UTC+03:00", "Istanbul (heure d’été)", "UTC+03:00", "heure : Istanbul", "UTC+03:00"): failure
        java.lang.AssertionError: expected [UTC+03:00] but found [UTC]
        at org.testng.Assert.fail(Assert.java:94)
        at org.testng.Assert.failNotEquals(Assert.java:496)
        at org.testng.Assert.assertEquals(Assert.java:125)
        at org.testng.Assert.assertEquals(Assert.java:178)
        at org.testng.Assert.assertEquals(Assert.java:188)
        at TimeZoneNamesTest.test_tzNames(TimeZoneNamesTest.java:185)
        at java.base/jdk.internal.reflect.NativeMethodAccessorImpl.invoke0(Native Method)
        at java.base/jdk.internal.reflect.NativeMethodAccessorImpl.invoke(NativeMethodAccessorImpl.java:64)
        at java.base/jdk.internal.reflect.DelegatingMethodAccessorImpl.invoke(DelegatingMethodAccessorImpl.java:43)
        at java.base/java.lang.reflect.Method.invoke(Method.java:564)
        at org.testng.internal.MethodInvocationHelper.invokeMethod(MethodInvocationHelper.java:85)
        at org.testng.internal.Invoker.invokeMethod(Invoker.java:639)
        at org.testng.internal.Invoker.invokeTestMethod(Invoker.java:821)
        at org.testng.internal.Invoker.invokeTestMethods(Invoker.java:1131)
        at org.testng.internal.TestMethodWorker.invokeTestMethods(TestMethodWorker.java:125)
        at org.testng.internal.TestMethodWorker.run(TestMethodWorker.java:108)
        at org.testng.TestRunner.privateRun(TestRunner.java:773)
        at org.testng.TestRunner.run(TestRunner.java:623)
        at org.testng.SuiteRunner.runTest(SuiteRunner.java:357)
        at org.testng.SuiteRunner.runSequentially(SuiteRunner.java:352)
        at org.testng.SuiteRunner.privateRun(SuiteRunner.java:310)
        at org.testng.SuiteRunner.run(SuiteRunner.java:259)
        at org.testng.SuiteRunnerWorker.runSuite(SuiteRunnerWorker.java:52)
        at org.testng.SuiteRunnerWorker.run(SuiteRunnerWorker.java:86)
        at org.testng.TestNG.runSuitesSequentially(TestNG.java:1185)
        at org.testng.TestNG.runSuitesLocally(TestNG.java:1110)
        at org.testng.TestNG.run(TestNG.java:1018)
        at com.sun.javatest.regtest.agent.TestNGRunner.main(TestNGRunner.java:94)
        at com.sun.javatest.regtest.agent.TestNGRunner.main(TestNGRunner.java:54)
        at java.base/jdk.internal.reflect.NativeMethodAccessorImpl.invoke0(Native Method)
        at java.base/jdk.internal.reflect.NativeMethodAccessorImpl.invoke(NativeMethodAccessorImpl.java:64)
        at java.base/jdk.internal.reflect.DelegatingMethodAccessorImpl.invoke(DelegatingMethodAccessorImpl.java:43)
        at java.base/java.lang.reflect.Method.invoke(Method.java:564)
        at com.sun.javatest.regtest.agent.MainWrapper$MainThread.run(MainWrapper.java:127)
        at java.base/java.lang.Thread.run(Thread.java:832)
        test TimeZoneNamesTest.test_tzNames("Asia/Istanbul", en_US, "Istanbul Standard Time", "GMT+03:00", "Istanbul Daylight Time", "GMT+03:00", "Istanbul Time", "GMT+03:00"): failure
        java.lang.AssertionError: expected [GMT+03:00] but found [GMT]
        at org.testng.Assert.fail(Assert.java:94)
        at org.testng.Assert.failNotEquals(Assert.java:496)
        at org.testng.Assert.assertEquals(Assert.java:125)
        at org.testng.Assert.assertEquals(Assert.java:178)
        at org.testng.Assert.assertEquals(Assert.java:188)
        at TimeZoneNamesTest.test_tzNames(TimeZoneNamesTest.java:185)
        at jdk.internal.reflect.GeneratedMethodAccessor1.invoke(Unknown Source)
        at java.base/jdk.internal.reflect.DelegatingMethodAccessorImpl.invoke(DelegatingMethodAccessorImpl.java:43)
        at java.base/java.lang.reflect.Method.invoke(Method.java:564)
        at org.testng.internal.MethodInvocationHelper.invokeMethod(MethodInvocationHelper.java:85)
        at org.testng.internal.Invoker.invokeMethod(Invoker.java:639)
        at org.testng.internal.Invoker.invokeTestMethod(Invoker.java:821)
        at org.testng.internal.Invoker.invokeTestMethods(Invoker.java:1131)
        at org.testng.internal.TestMethodWorker.invokeTestMethods(TestMethodWorker.java:125)
        at org.testng.internal.TestMethodWorker.run(TestMethodWorker.java:108)
        at org.testng.TestRunner.privateRun(TestRunner.java:773)
        at org.testng.TestRunner.run(TestRunner.java:623)
        at org.testng.SuiteRunner.runTest(SuiteRunner.java:357)
        at org.testng.SuiteRunner.runSequentially(SuiteRunner.java:352)
        at org.testng.SuiteRunner.privateRun(SuiteRunner.java:310)
        at org.testng.SuiteRunner.run(SuiteRunner.java:259)
        at org.testng.SuiteRunnerWorker.runSuite(SuiteRunnerWorker.java:52)
        at org.testng.SuiteRunnerWorker.run(SuiteRunnerWorker.java:86)
        at org.testng.TestNG.runSuitesSequentially(TestNG.java:1185)
        at org.testng.TestNG.runSuitesLocally(TestNG.java:1110)
        at org.testng.TestNG.run(TestNG.java:1018)
        at com.sun.javatest.regtest.agent.TestNGRunner.main(TestNGRunner.java:94)
        at com.sun.javatest.regtest.agent.TestNGRunner.main(TestNGRunner.java:54)
        at java.base/jdk.internal.reflect.NativeMethodAccessorImpl.invoke0(Native Method)
        at java.base/jdk.internal.reflect.NativeMethodAccessorImpl.invoke(NativeMethodAccessorImpl.java:64)
        at java.base/jdk.internal.reflect.DelegatingMethodAccessorImpl.invoke(DelegatingMethodAccessorImpl.java:43)
        at java.base/java.lang.reflect.Method.invoke(Method.java:564)
        at com.sun.javatest.regtest.agent.MainWrapper$MainThread.run(MainWrapper.java:127)
        at java.base/java.lang.Thread.run(Thread.java:832)
        test TimeZoneNamesTest.test_tzNames("Asia/Istanbul", fr_FR, "Istanbul (heure standard)", "UTC+03:00", "Istanbul (heure d’été)", "UTC+03:00", "heure : Istanbul", "UTC+03:00"): failure
        java.lang.AssertionError: expected [UTC+03:00] but found [UTC]
        at org.testng.Assert.fail(Assert.java:94)
        at org.testng.Assert.failNotEquals(Assert.java:496)
        at org.testng.Assert.assertEquals(Assert.java:125)
        at org.testng.Assert.assertEquals(Assert.java:178)
        at org.testng.Assert.assertEquals(Assert.java:188)
        at TimeZoneNamesTest.test_tzNames(TimeZoneNamesTest.java:185)
        at jdk.internal.reflect.GeneratedMethodAccessor1.invoke(Unknown Source)
        at java.base/jdk.internal.reflect.DelegatingMethodAccessorImpl.invoke(DelegatingMethodAccessorImpl.java:43)
        at java.base/java.lang.reflect.Method.invoke(Method.java:564)
        at org.testng.internal.MethodInvocationHelper.invokeMethod(MethodInvocationHelper.java:85)
        at org.testng.internal.Invoker.invokeMethod(Invoker.java:639)
        at org.testng.internal.Invoker.invokeTestMethod(Invoker.java:821)
        at org.testng.internal.Invoker.invokeTestMethods(Invoker.java:1131)
        at org.testng.internal.TestMethodWorker.invokeTestMethods(TestMethodWorker.java:125)
        at org.testng.internal.TestMethodWorker.run(TestMethodWorker.java:108)
        at org.testng.TestRunner.privateRun(TestRunner.java:773)
        at org.testng.TestRunner.run(TestRunner.java:623)
        at org.testng.SuiteRunner.runTest(SuiteRunner.java:357)
        at org.testng.SuiteRunner.runSequentially(SuiteRunner.java:352)
        at org.testng.SuiteRunner.privateRun(SuiteRunner.java:310)
        at org.testng.SuiteRunner.run(SuiteRunner.java:259)
        at org.testng.SuiteRunnerWorker.runSuite(SuiteRunnerWorker.java:52)
        at org.testng.SuiteRunnerWorker.run(SuiteRunnerWorker.java:86)
        at org.testng.TestNG.runSuitesSequentially(TestNG.java:1185)
        at org.testng.TestNG.runSuitesLocally(TestNG.java:1110)
        at org.testng.TestNG.run(TestNG.java:1018)
        at com.sun.javatest.regtest.agent.TestNGRunner.main(TestNGRunner.java:94)
        at com.sun.javatest.regtest.agent.TestNGRunner.main(TestNGRunner.java:54)
        at java.base/jdk.internal.reflect.NativeMethodAccessorImpl.invoke0(Native Method)
        at java.base/jdk.internal.reflect.NativeMethodAccessorImpl.invoke(NativeMethodAccessorImpl.java:64)
        at java.base/jdk.internal.reflect.DelegatingMethodAccessorImpl.invoke(DelegatingMethodAccessorImpl.java:43)
        at java.base/java.lang.reflect.Method.invoke(Method.java:564)
        at com.sun.javatest.regtest.agent.MainWrapper$MainThread.run(MainWrapper.java:127)
        at java.base/java.lang.Thread.run(Thread.java:832)
        test TimeZoneNamesTest.test_tzNames("Turkey", en_US, "Istanbul Standard Time", "GMT+03:00", "Istanbul Daylight Time", "GMT+03:00", "Istanbul Time", "GMT+03:00"): failure
        java.lang.AssertionError: expected [GMT+03:00] but found [GMT]
        at org.testng.Assert.fail(Assert.java:94)
        at org.testng.Assert.failNotEquals(Assert.java:496)
        at org.testng.Assert.assertEquals(Assert.java:125)
        at org.testng.Assert.assertEquals(Assert.java:178)
        at org.testng.Assert.assertEquals(Assert.java:188)
        at TimeZoneNamesTest.test_tzNames(TimeZoneNamesTest.java:185)
        at jdk.internal.reflect.GeneratedMethodAccessor1.invoke(Unknown Source)
        at java.base/jdk.internal.reflect.DelegatingMethodAccessorImpl.invoke(DelegatingMethodAccessorImpl.java:43)
        at java.base/java.lang.reflect.Method.invoke(Method.java:564)
        at org.testng.internal.MethodInvocationHelper.invokeMethod(MethodInvocationHelper.java:85)
        at org.testng.internal.Invoker.invokeMethod(Invoker.java:639)
        at org.testng.internal.Invoker.invokeTestMethod(Invoker.java:821)
        at org.testng.internal.Invoker.invokeTestMethods(Invoker.java:1131)
        at org.testng.internal.TestMethodWorker.invokeTestMethods(TestMethodWorker.java:125)
        at org.testng.internal.TestMethodWorker.run(TestMethodWorker.java:108)
        at org.testng.TestRunner.privateRun(TestRunner.java:773)
        at org.testng.TestRunner.run(TestRunner.java:623)
        at org.testng.SuiteRunner.runTest(SuiteRunner.java:357)
        at org.testng.SuiteRunner.runSequentially(SuiteRunner.java:352)
        at org.testng.SuiteRunner.privateRun(SuiteRunner.java:310)
        at org.testng.SuiteRunner.run(SuiteRunner.java:259)
        at org.testng.SuiteRunnerWorker.runSuite(SuiteRunnerWorker.java:52)
        at org.testng.SuiteRunnerWorker.run(SuiteRunnerWorker.java:86)
        at org.testng.TestNG.runSuitesSequentially(TestNG.java:1185)
        at org.testng.TestNG.runSuitesLocally(TestNG.java:1110)
        at org.testng.TestNG.run(TestNG.java:1018)
        at com.sun.javatest.regtest.agent.TestNGRunner.main(TestNGRunner.java:94)
        at com.sun.javatest.regtest.agent.TestNGRunner.main(TestNGRunner.java:54)
        at java.base/jdk.internal.reflect.NativeMethodAccessorImpl.invoke0(Native Method)
        at java.base/jdk.internal.reflect.NativeMethodAccessorImpl.invoke(NativeMethodAccessorImpl.java:64)
        at java.base/jdk.internal.reflect.DelegatingMethodAccessorImpl.invoke(DelegatingMethodAccessorImpl.java:43)
        at java.base/java.lang.reflect.Method.invoke(Method.java:564)
        at com.sun.javatest.regtest.agent.MainWrapper$MainThread.run(MainWrapper.java:127)
        at java.base/java.lang.Thread.run(Thread.java:832)
        test TimeZoneNamesTest.test_tzNames("Turkey", fr_FR, "Istanbul (heure standard)", "UTC+03:00", "Istanbul (heure d’été)", "UTC+03:00", "heure : Istanbul", "UTC+03:00"): failure
        java.lang.AssertionError: expected [UTC+03:00] but found [UTC]
        at org.testng.Assert.fail(Assert.java:94)
        at org.testng.Assert.failNotEquals(Assert.java:496)
        at org.testng.Assert.assertEquals(Assert.java:125)
        at org.testng.Assert.assertEquals(Assert.java:178)
        at org.testng.Assert.assertEquals(Assert.java:188)
        at TimeZoneNamesTest.test_tzNames(TimeZoneNamesTest.java:185)
        at jdk.internal.reflect.GeneratedMethodAccessor1.invoke(Unknown Source)
        at java.base/jdk.internal.reflect.DelegatingMethodAccessorImpl.invoke(DelegatingMethodAccessorImpl.java:43)
        at java.base/java.lang.reflect.Method.invoke(Method.java:564)
        at org.testng.internal.MethodInvocationHelper.invokeMethod(MethodInvocationHelper.java:85)
        at org.testng.internal.Invoker.invokeMethod(Invoker.java:639)
        at org.testng.internal.Invoker.invokeTestMethod(Invoker.java:821)
        at org.testng.internal.Invoker.invokeTestMethods(Invoker.java:1131)
        at org.testng.internal.TestMethodWorker.invokeTestMethods(TestMethodWorker.java:125)
        at org.testng.internal.TestMethodWorker.run(TestMethodWorker.java:108)
        at org.testng.TestRunner.privateRun(TestRunner.java:773)
        at org.testng.TestRunner.run(TestRunner.java:623)
        at org.testng.SuiteRunner.runTest(SuiteRunner.java:357)
        at org.testng.SuiteRunner.runSequentially(SuiteRunner.java:352)
        at org.testng.SuiteRunner.privateRun(SuiteRunner.java:310)
        at org.testng.SuiteRunner.run(SuiteRunner.java:259)
        at org.testng.SuiteRunnerWorker.runSuite(SuiteRunnerWorker.java:52)
        at org.testng.SuiteRunnerWorker.run(SuiteRunnerWorker.java:86)
        at org.testng.TestNG.runSuitesSequentially(TestNG.java:1185)
        at org.testng.TestNG.runSuitesLocally(TestNG.java:1110)
        at org.testng.TestNG.run(TestNG.java:1018)
        at com.sun.javatest.regtest.agent.TestNGRunner.main(TestNGRunner.java:94)
        at com.sun.javatest.regtest.agent.TestNGRunner.main(TestNGRunner.java:54)
        at java.base/jdk.internal.reflect.NativeMethodAccessorImpl.invoke0(Native Method)
        at java.base/jdk.internal.reflect.NativeMethodAccessorImpl.invoke(NativeMethodAccessorImpl.java:64)
        at java.base/jdk.internal.reflect.DelegatingMethodAccessorImpl.invoke(DelegatingMethodAccessorImpl.java:43)
        at java.base/java.lang.reflect.Method.invoke(Method.java:564)
        at com.sun.javatest.regtest.agent.MainWrapper$MainThread.run(MainWrapper.java:127)
        at java.base/java.lang.Thread.run(Thread.java:832)

        ===============================================
        sun/util/resources/cldr/TimeZoneNamesTest.java
        Total tests run: 21, Failures: 20, Skips: 0
        ===============================================

        java.lang.Exception: failures: 20
        at com.sun.javatest.regtest.agent.TestNGRunner.main(TestNGRunner.java:96)
        at com.sun.javatest.regtest.agent.TestNGRunner.main(TestNGRunner.java:54)
        at java.base/jdk.internal.reflect.NativeMethodAccessorImpl.invoke0(Native Method)
        at java.base/jdk.internal.reflect.NativeMethodAccessorImpl.invoke(NativeMethodAccessorImpl.java:64)
        at java.base/jdk.internal.reflect.DelegatingMethodAccessorImpl.invoke(DelegatingMethodAccessorImpl.java:43)
        at java.base/java.lang.reflect.Method.invoke(Method.java:564)
        at com.sun.javatest.regtest.agent.MainWrapper$MainThread.run(MainWrapper.java:127)
        at java.base/java.lang.Thread.run(Thread.java:832)

        JavaTest Message: Test threw exception: java.lang.Exception: failures: 20
        JavaTest Message: shutting down test

        STATUS:Failed.`main' threw exception: java.lang.Exception: failures: 20

          Attachments

            Issue Links

              Activity

                People

                • Assignee:
                  chagedorn Christian Hagedorn
                  Reporter:
                  chagedorn Christian Hagedorn
                • Votes:
                  0 Vote for this issue
                  Watchers:
                  3 Start watching this issue

                  Dates

                  • Created:
                    Updated:
                    Resolved: