Uploaded image for project: 'JDK'
  1. JDK
  2. JDK-8249246

jshell/FailOverDirectExecutionControlTest.java failed "AssertionError: expected [2] but found [3]"

    Details

    • Type: Bug
    • Status: Open
    • Priority: P4
    • Resolution: Unresolved
    • Affects Version/s: 16
    • Fix Version/s: 16
    • Component/s: tools
    • Subcomponent:
    • CPU:
      x86_64
    • OS:
      linux

      Description

      The following test failed in the JDK16 CI:

      jdk/jshell/FailOverDirectExecutionControlTest.java

      Here's a snippet from the log file:

      ----------System.out:(62/3763)----------
      [TestNG] Running:
        jdk/jshell/FailOverDirectExecutionControlTest.java

      config FailOverDirectExecutionControlTest.setUp(): success
      test ExecutionControlTestBase.classesDeclaration(): success
      config FailOverDirectExecutionControlTest.tearDown(): success
      config FailOverDirectExecutionControlTest.setUp(): success
      test ExecutionControlTestBase.interfaceTest(): success
      config FailOverDirectExecutionControlTest.tearDown(): success
      config FailOverDirectExecutionControlTest.setUp(): success
      test ExecutionControlTestBase.methodOverload(): success
      config FailOverDirectExecutionControlTest.tearDown(): success
      config FailOverDirectExecutionControlTest.setUp(): success
      test ExecutionControlTestBase.testExprSanity(): success
      config FailOverDirectExecutionControlTest.tearDown(): success
      config FailOverDirectExecutionControlTest.setUp(): success
      test ExecutionControlTestBase.testImportOnDemand(): success
      config FailOverDirectExecutionControlTest.tearDown(): success
      config FailOverDirectExecutionControlTest.setUp(): success
      test FailOverDirectExecutionControlTest.variables(): failure
      java.lang.AssertionError: expected [2] but found [3]
      at org.testng.Assert.fail(Assert.java:94)
      at org.testng.Assert.failNotEquals(Assert.java:496)
      at org.testng.Assert.assertEquals(Assert.java:125)
      at org.testng.Assert.assertEquals(Assert.java:372)
      at org.testng.Assert.assertEquals(Assert.java:382)
      at FailOverDirectExecutionControlTest.variables(FailOverDirectExecutionControlTest.java:151)
      at java.base/jdk.internal.reflect.NativeMethodAccessorImpl.invoke0(Native Method)
      at java.base/jdk.internal.reflect.NativeMethodAccessorImpl.invoke(NativeMethodAccessorImpl.java:64)
      at java.base/jdk.internal.reflect.DelegatingMethodAccessorImpl.invoke(DelegatingMethodAccessorImpl.java:43)
      at java.base/java.lang.reflect.Method.invoke(Method.java:564)
      at org.testng.internal.MethodInvocationHelper.invokeMethod(MethodInvocationHelper.java:85)
      at org.testng.internal.Invoker.invokeMethod(Invoker.java:639)
      at org.testng.internal.Invoker.invokeTestMethod(Invoker.java:821)
      at org.testng.internal.Invoker.invokeTestMethods(Invoker.java:1131)
      at org.testng.internal.TestMethodWorker.invokeTestMethods(TestMethodWorker.java:124)
      at org.testng.internal.TestMethodWorker.run(TestMethodWorker.java:108)
      at org.testng.TestRunner.privateRun(TestRunner.java:773)
      at org.testng.TestRunner.run(TestRunner.java:623)
      at org.testng.SuiteRunner.runTest(SuiteRunner.java:357)
      at org.testng.SuiteRunner.runSequentially(SuiteRunner.java:352)
      at org.testng.SuiteRunner.privateRun(SuiteRunner.java:310)
      at org.testng.SuiteRunner.run(SuiteRunner.java:259)
      at org.testng.SuiteRunnerWorker.runSuite(SuiteRunnerWorker.java:52)
      at org.testng.SuiteRunnerWorker.run(SuiteRunnerWorker.java:86)
      at org.testng.TestNG.runSuitesSequentially(TestNG.java:1185)
      at org.testng.TestNG.runSuitesLocally(TestNG.java:1110)
      at org.testng.TestNG.run(TestNG.java:1018)
      at com.sun.javatest.regtest.agent.TestNGRunner.main(TestNGRunner.java:94)
      at java.base/jdk.internal.reflect.NativeMethodAccessorImpl.invoke0(Native Method)
      at java.base/jdk.internal.reflect.NativeMethodAccessorImpl.invoke(NativeMethodAccessorImpl.java:64)
      at java.base/jdk.internal.reflect.DelegatingMethodAccessorImpl.invoke(DelegatingMethodAccessorImpl.java:43)
      at java.base/java.lang.reflect.Method.invoke(Method.java:564)
      at com.sun.javatest.regtest.agent.MainActionHelper$AgentVMRunnable.run(MainActionHelper.java:298)
      at java.base/java.lang.Thread.run(Thread.java:832)
      config FailOverDirectExecutionControlTest.tearDown(): success

      ===============================================
      jdk/jshell/FailOverDirectExecutionControlTest.java
      Total tests run: 6, Failures: 1, Skips: 0
      ===============================================

      result: Failed. Execution failed: `main' threw exception: java.lang.Exception: failures: 1


      test result: Failed. Execution failed: `main' threw exception: java.lang.Exception: failures: 1

        Attachments

          Activity

            People

            • Assignee:
              rfield Robert Field
              Reporter:
              dcubed Daniel Daugherty
            • Votes:
              0 Vote for this issue
              Watchers:
              1 Start watching this issue

              Dates

              • Created:
                Updated: