Uploaded image for project: 'JDK'
  1. JDK
  2. JDK-8249751

Failed to execute goal org.apache.maven.plugins:maven-compiler-plugin:3.8.1:compile (default-compile) on project nifi-framework-cluster

    Details

    • Subcomponent:
    • CPU:
      x86_64
    • OS:
      windows_10

      Description

      ADDITIONAL SYSTEM INFORMATION :
      Windows 10 / Java 1.8

      A DESCRIPTION OF THE PROBLEM :
      Failed to execute goal org.apache.maven.plugins:maven-compiler-plugin:3.8.1:compile (default-compile) on project nifi-framework-cluster:

      STEPS TO FOLLOW TO REPRODUCE THE PROBLEM :
      mvn dependency:go-offline install -Dmaven.test.skip=true

      EXPECTED VERSUS ACTUAL BEHAVIOR :
      EXPECTED -
      Build Successful
      ACTUAL -
      [INFO] BUILD FAILURE
      [INFO] ------------------------------------------------------------------------
      [INFO] Total time: 06:04 min
      [INFO] Finished at: 2020-07-01T10:44:48+09:30
      [INFO] ------------------------------------------------------------------------
      [ERROR] Failed to execute goal org.apache.maven.plugins:maven-compiler-plugin:3.8.1:compile (default-compile) on project nifi-framework-cluster: Compilation failure
      [ERROR] An exception has occurred in the compiler (1.8.0_31). Please file a bug at the Java Developer Connection (http://java.sun.com/webapps/bugreport) after checking the Bug Parade for duplicates. Include your program and the following diagnostic in your report. T
      hank you.
      [ERROR] java.lang.AssertionError: isSubClass EntityType
      [ERROR] at com.sun.tools.javac.code.Symbol.isSubClass(Symbol.java:447)
      [ERROR] at com.sun.tools.javac.code.Symbol.isMemberOf(Symbol.java:456)
      [ERROR] at com.sun.tools.javac.code.Symbol$MethodSymbol.overrides(Symbol.java:1469)
      [ERROR] at com.sun.tools.javac.code.Types$ImplementationCache.implementationInternal(Types.java:2671)
      [ERROR] at com.sun.tools.javac.code.Types$ImplementationCache.get(Types.java:2653)
      [ERROR] at com.sun.tools.javac.code.Types.implementation(Types.java:2682)
      [ERROR] at com.sun.tools.javac.code.Symbol$MethodSymbol.implementation(Symbol.java:1529)
      [ERROR] at com.sun.tools.javac.code.Symbol$MethodSymbol.implementation(Symbol.java:1518)
      [ERROR] at com.sun.tools.javac.comp.Resolve.notOverriddenIn(Resolve.java:416)
      [ERROR] at com.sun.tools.javac.comp.Resolve.isAccessible(Resolve.java:402)
      [ERROR] at com.sun.tools.javac.comp.Resolve.isAccessible(Resolve.java:362)
      [ERROR] at com.sun.tools.javac.comp.Resolve.selectBest(Resolve.java:1448)
      [ERROR] at com.sun.tools.javac.comp.Resolve.findMethodInScope(Resolve.java:1618)
      [ERROR] at com.sun.tools.javac.comp.Resolve.findMethod(Resolve.java:1710)
      [ERROR] at com.sun.tools.javac.comp.Resolve.findMethod(Resolve.java:1662)
      [ERROR] at com.sun.tools.javac.comp.DeferredAttr$DeferredChecker$2.lookup(DeferredAttr.java:1325)
      [ERROR] at com.sun.tools.javac.comp.Resolve.lookupMethod(Resolve.java:3325)
      [ERROR] at com.sun.tools.javac.comp.Resolve.lookupMethod(Resolve.java:3310)
      [ERROR] at com.sun.tools.javac.comp.DeferredAttr$DeferredChecker.quicklyResolveMethod(DeferredAttr.java:1333)
      [ERROR] at com.sun.tools.javac.comp.DeferredAttr$DeferredChecker.visitApply(DeferredAttr.java:1223)
      [ERROR] at com.sun.tools.javac.tree.JCTree$JCMethodInvocation.accept(JCTree.java:1465)
      [ERROR] at com.sun.tools.javac.tree.TreeScanner.scan(TreeScanner.java:49)
      [ERROR] at com.sun.tools.javac.comp.DeferredAttr$FilterScanner.scan(DeferredAttr.java:901)
      [ERROR] at com.sun.tools.javac.comp.DeferredAttr.isDeferred(DeferredAttr.java:1088)
      [ERROR] at com.sun.tools.javac.comp.Attr.attribArgs(Attr.java:701)
      [ERROR] at com.sun.tools.javac.comp.Attr.visitApply(Attr.java:1834)
      [ERROR] at com.sun.tools.javac.tree.JCTree$JCMethodInvocation.accept(JCTree.java:1465)
      [ERROR] at com.sun.tools.javac.comp.Attr.attribTree(Attr.java:607)
      [ERROR] at com.sun.tools.javac.comp.Attr.attribExpr(Attr.java:656)
      [ERROR] at com.sun.tools.javac.comp.Attr.visitExec(Attr.java:1611)
      [ERROR] at com.sun.tools.javac.tree.JCTree$JCExpressionStatement.accept(JCTree.java:1296)
      [ERROR] at com.sun.tools.javac.comp.Attr.attribTree(Attr.java:607)
      [ERROR] at com.sun.tools.javac.comp.Attr.attribStat(Attr.java:676)
      [ERROR] at com.sun.tools.javac.comp.Attr.attribStats(Attr.java:692)
      [ERROR] at com.sun.tools.javac.comp.Attr.visitBlock(Attr.java:1142)
      [ERROR] at com.sun.tools.javac.tree.JCTree$JCBlock.accept(JCTree.java:909)
      [ERROR] at com.sun.tools.javac.comp.Attr.attribTree(Attr.java:607)
      [ERROR] at com.sun.tools.javac.comp.Attr.attribStat(Attr.java:676)
      [ERROR] at com.sun.tools.javac.comp.Attr.visitForeachLoop(Attr.java:1207)
      [ERROR] at com.sun.tools.javac.tree.JCTree$JCEnhancedForLoop.accept(JCTree.java:1035)
      [ERROR] at com.sun.tools.javac.comp.Attr.attribTree(Attr.java:607)
      [ERROR] at com.sun.tools.javac.comp.Attr.attribStat(Attr.java:676)
      [ERROR] at com.sun.tools.javac.comp.Attr.attribStats(Attr.java:692)
      [ERROR] at com.sun.tools.javac.comp.Attr.visitBlock(Attr.java:1142)
      [ERROR] at com.sun.tools.javac.tree.JCTree$JCBlock.accept(JCTree.java:909)
      [ERROR] at com.sun.tools.javac.comp.Attr.attribTree(Attr.java:607)
      [ERROR] at com.sun.tools.javac.comp.Attr.attribStat(Attr.java:676)
      [ERROR] at com.sun.tools.javac.comp.Attr.visitMethodDef(Attr.java:1035)
      [ERROR] at com.sun.tools.javac.tree.JCTree$JCMethodDecl.accept(JCTree.java:778)
      [ERROR] at com.sun.tools.javac.comp.Attr.attribTree(Attr.java:607)
      [ERROR] at com.sun.tools.javac.comp.Attr.attribStat(Attr.java:676)
      [ERROR] at com.sun.tools.javac.comp.Attr.attribClassBody(Attr.java:4342)
      [ERROR] at com.sun.tools.javac.comp.Attr.attribClass(Attr.java:4252)
      [ERROR] at com.sun.tools.javac.comp.Attr.attribClass(Attr.java:4181)
      [ERROR] at com.sun.tools.javac.comp.Attr.attrib(Attr.java:4156)
      [ERROR] at com.sun.tools.javac.main.JavaCompiler.attribute(JavaCompiler.java:1248)
      [ERROR] at com.sun.tools.javac.main.JavaCompiler.compile2(JavaCompiler.java:901)
      [ERROR] at com.sun.tools.javac.main.JavaCompiler.compile(JavaCompiler.java:860)
      [ERROR] at com.sun.tools.javac.main.Main.compile(Main.java:523)
      [ERROR] at com.sun.tools.javac.main.Main.compile(Main.java:381)
      [ERROR] at com.sun.tools.javac.main.Main.compile(Main.java:370)
      [ERROR] at com.sun.tools.javac.main.Main.compile(Main.java:361)
      [ERROR] at com.sun.tools.javac.Main.compile(Main.java:56)
      [ERROR] at com.sun.tools.javac.Main.main(Main.java:42)
      [ERROR]
      [ERROR]
      [ERROR] -> [Help 1]
      [ERROR]
      [ERROR] To see the full stack trace of the errors, re-run Maven with the -e switch.
      [ERROR] Re-run Maven using the -X switch to enable full debug logging.
      [ERROR]
      [ERROR] For more information about the errors and possible solutions, please read the following articles:
      [ERROR] [Help 1] http://cwiki.apache.org/confluence/display/MAVEN/MojoFailureException
      [ERROR]
      [ERROR] After correcting the problems, you can resume the build with the command
      [ERROR] mvn <args> -rf :nifi-framework-cluster


        Attachments

          Activity

            People

            • Assignee:
              pnarayanaswa Praveen Narayanaswamy
              Reporter:
              webbuggrp Webbug Group
            • Votes:
              0 Vote for this issue
              Watchers:
              2 Start watching this issue

              Dates

              • Created:
                Updated:
                Resolved: