Uploaded image for project: 'JDK'
  1. JDK
  2. JDK-8251192

Shenandoah: Shenandoah build failed after JDK-8235573

    XMLWordPrintable

    Details

    • Subcomponent:
      gc
    • Resolved In Build:
      b10

      Description

      n file included from /home/zgu/ws/jdk/src/hotspot/share/gc/shenandoah/heuristics/shenandoahHeuristics.hpp:29,
                       from /home/zgu/ws/jdk/src/hotspot/share/gc/shenandoah/heuristics/shenandoahAdaptiveHeuristics.hpp:28,
                       from /home/zgu/ws/jdk/src/hotspot/share/gc/shenandoah/heuristics/shenandoahAdaptiveHeuristics.cpp:27:
      /home/zgu/ws/jdk/src/hotspot/share/gc/shenandoah/shenandoahPhaseTimings.hpp:236:3: error: 'EventGCPhaseParallel' does not name a type
        236 | EventGCPhaseParallel _event;
            | ^~~~~~~~~~~~~~~~~~~~
      In file included from /home/zgu/ws/jdk/src/hotspot/share/gc/shenandoah/heuristics/shenandoahHeuristics.hpp:29,
                       from /home/zgu/ws/jdk/src/hotspot/share/gc/shenandoah/heuristics/shenandoahAggressiveHeuristics.hpp:28,
                       from /home/zgu/ws/jdk/src/hotspot/share/gc/shenandoah/heuristics/shenandoahAggressiveHeuristics.cpp:27:
      /home/zgu/ws/jdk/src/hotspot/share/gc/shenandoah/shenandoahPhaseTimings.hpp:236:3: error: 'EventGCPhaseParallel' does not name a type
        236 | EventGCPhaseParallel _event;
            | ^~~~~~~~~~~~~~~~~~~~
      gmake[3]: *** [lib/CompileJvm.gmk:143: /home/zgu/ws/jdk/build/linux-x86_64-server-fastdebug/hotspot/variant-server/libjvm/objs/shenandoahAggressiveHeuristics.o] Error 1

        Attachments

          Issue Links

            Activity

              People

              Assignee:
              zgu Zhengyu Gu
              Reporter:
              zgu Zhengyu Gu
              Votes:
              0 Vote for this issue
              Watchers:
              2 Start watching this issue

                Dates

                Created:
                Updated:
                Resolved: