Uploaded image for project: 'JDK'
  1. JDK
  2. JDK-8252886

[TESTBUG] sun/security/ec/TestEC.java : Compilation failed

    XMLWordPrintable

    Details

      Backports

        Description

        Test: jdk/test/sun/security/ec/TestEC.java

        ----------System.err:(36/1939)----------
        /media/psf/Home/Work/openjdk/jdk8u/jdk/test/sun/security/pkcs11/sslecc/CipherTest.java:108: error: cannot find symbol
                CipherSuite cipherSuite;
                ^
          symbol: class CipherSuite
          location: class TestParameters
        /media/psf/Home/Work/openjdk/jdk8u/jdk/test/sun/security/pkcs11/sslecc/CipherTest.java:109: error: cannot find symbol
                Protocol protocol;
                ^
          symbol: class Protocol
          location: class TestParameters
        /media/psf/Home/Work/openjdk/jdk8u/jdk/test/sun/security/pkcs11/sslecc/CipherTest.java:112: error: cannot find symbol
                TestParameters(CipherSuite cipherSuite, Protocol protocol,
                               ^
          symbol: class CipherSuite
          location: class TestParameters
        /media/psf/Home/Work/openjdk/jdk8u/jdk/test/sun/security/pkcs11/sslecc/CipherTest.java:112: error: cannot find symbol
                TestParameters(CipherSuite cipherSuite, Protocol protocol,
                                                        ^
          symbol: class Protocol
          location: class TestParameters
        /media/psf/Home/Work/openjdk/jdk8u/jdk/test/sun/security/pkcs11/sslecc/CipherTest.java:164: error: package CipherSuite does not exist
                                            CipherSuite.TLS_EMPTY_RENEGOTIATION_INFO_SCSV.name())
                                                       ^
        /media/psf/Home/Work/openjdk/jdk8u/jdk/test/sun/security/pkcs11/sslecc/CipherTest.java:170: error: cannot find symbol
                                    CipherSuite.cipherSuite(cipherSuite),
                                    ^
          symbol: variable CipherSuite
          location: class CipherTest
        /media/psf/Home/Work/openjdk/jdk8u/jdk/test/sun/security/pkcs11/sslecc/CipherTest.java:171: error: cannot find symbol
                                    Protocol.protocol(protocol),
                                    ^
          symbol: variable Protocol
          location: class CipherTest
        Note: Some input files use unchecked or unsafe operations.
        Note: Recompile with -Xlint:unchecked for details.
        7 errors
        result: Failed. Compilation failed: Compilation failed

        test result: Failed. Compilation failed: Compilation failed

          Attachments

            Issue Links

              Activity

                People

                Assignee:
                abakhtin Alexey Bakhtin
                Reporter:
                abakhtin Alexey Bakhtin
                Votes:
                0 Vote for this issue
                Watchers:
                3 Start watching this issue

                  Dates

                  Created:
                  Updated:
                  Resolved: