Uploaded image for project: 'JDK'
  1. JDK
  2. JDK-8252950

Lanai : sun/java2d/DirectX/OpaqueImageToSurfaceBlitTest/OpaqueImageToSurfaceBlitTest.java fails

    Details

    • Subcomponent:
      2d
    • OS:
      os_x

      Description

      Fails with the EA5 candidate(8-September) build
      ----------System.out:(2/56)----------
           Metal: Supported, feature set macOS GPUFamily2 v1

      ----------System.err:(15/998)----------
      metalEnabled=1
      Metal support is present
      java.lang.RuntimeException: Test FAILED: color at 0x0 =ff000000 differs from 1x1 =ff00007f
      at OpaqueImageToSurfaceBlitTest.main(OpaqueImageToSurfaceBlitTest.java:70)
      at java.base/jdk.internal.reflect.NativeMethodAccessorImpl.invoke0(Native Method)
      at java.base/jdk.internal.reflect.NativeMethodAccessorImpl.invoke(NativeMethodAccessorImpl.java:64)
      at java.base/jdk.internal.reflect.DelegatingMethodAccessorImpl.invoke(DelegatingMethodAccessorImpl.java:43)
      at java.base/java.lang.reflect.Method.invoke(Method.java:564)
      at com.sun.javatest.regtest.agent.MainWrapper$MainThread.run(MainWrapper.java:127)
      at java.base/java.lang.Thread.run(Thread.java:832)

      JavaTest Message: Test threw exception: java.lang.RuntimeException: Test FAILED: color at 0x0 =ff000000 differs from 1x1 =ff00007f
      JavaTest Message: shutting down test

        Attachments

          Issue Links

            Activity

              People

              • Assignee:
                dkonoplev Denis Konoplev
                Reporter:
                trebari Tejpal Rebari
              • Votes:
                0 Vote for this issue
                Watchers:
                3 Start watching this issue

                Dates

                • Created:
                  Updated:
                  Resolved: