Uploaded image for project: 'JDK'
  1. JDK
  2. JDK-8254604

java/awt/dnd/DragTerminationTest/DragTerminationTest.html failed with "RuntimeException: Drag is not terminated when appropriate."

    Details

    • Subcomponent:
    • CPU:
      x86_64
    • OS:
      os_x_10.15

      Description

      The following test failed in the JDK16 CI:

      java/awt/dnd/DragTerminationTest/DragTerminationTest.html

      Here's a snippet from the log file:

      ----------System.err:(6/408)----------
      Dropped string: null
      java.lang.RuntimeException: Drag is not terminated when appropriate.
      at DragTerminationTest.start(DragTerminationTest.java:151)
      at com.sun.javatest.regtest.agent.AppletWrapper$AppletRunnable.run(AppletWrapper.java:157)
      at java.base/java.lang.Thread.run(Thread.java:832)
      STATUS:Failed.Applet thread threw exception: java.lang.RuntimeException: Drag is not terminated when appropriate.
      ----------rerun:(41/5902)*----------

        Attachments

          Activity

            People

            • Assignee:
              pbansal Pankaj Bansal
              Reporter:
              dcubed Daniel Daugherty
            • Votes:
              0 Vote for this issue
              Watchers:
              4 Start watching this issue

              Dates

              • Created:
                Updated: