Uploaded image for project: 'JDK'
  1. JDK
  2. JDK-8255868

Test java/awt/Mixing/AWT_Mixing/HierarchyBoundsListenerMixingTest.java fails

    Details

    • Type: Bug
    • Status: Closed
    • Priority: P4
    • Resolution: Cannot Reproduce
    • Affects Version/s: 15, 16
    • Fix Version/s: tbd
    • Component/s: client-libs

      Description

      Test java/awt/Mixing/AWT_Mixing/HierarchyBoundsListenerMixingTest.java fails on Linux platform with the following error message

      he test failed: Test failed
      The test is over, hit Ctl-C to stop Java VM
      ----------System.err:(25/2012)----------
      FAIL: Frame resized using mouse action. Ancestor resized event did not occur for class java.awt.Panel
      FAIL: Frame resized using mouse action. Ancestor resized event did not occur for class java.awt.Button
      FAIL: Frame resized using mouse action. Ancestor resized event did not occur for class java.awt.Label
      FAIL: Frame resized using mouse action. Ancestor resized event did not occur for class java.awt.List
      FAIL: Frame resized using mouse action. Ancestor resized event did not occur for class java.awt.Choice
      FAIL: Frame resized using mouse action. Ancestor resized event did not occur for class java.awt.Checkbox
      FAIL: Frame resized using mouse action. Ancestor resized event did not occur for class java.awt.Scrollbar
      FAIL: Frame resized using mouse action. Ancestor resized event did not occur for class java.awt.TextField
      FAIL: Frame resized using mouse action. Ancestor resized event did not occur for class java.awt.TextArea
      java.lang.RuntimeException: Test failed
      at HierarchyBoundsListenerMixingTest.fail(HierarchyBoundsListenerMixingTest.java:520)
      at HierarchyBoundsListenerMixingTest.invoke(HierarchyBoundsListenerMixingTest.java:414)
      at HierarchyBoundsListenerMixingTest.init(HierarchyBoundsListenerMixingTest.java:439)
      at HierarchyBoundsListenerMixingTest.main(HierarchyBoundsListenerMixingTest.java:456)
      at java.base/jdk.internal.reflect.NativeMethodAccessorImpl.invoke0(Native Method)
      at java.base/jdk.internal.reflect.NativeMethodAccessorImpl.invoke(NativeMethodAccessorImpl.java:64)
      at java.base/jdk.internal.reflect.DelegatingMethodAccessorImpl.invoke(DelegatingMethodAccessorImpl.java:43)
      at java.base/java.lang.reflect.Method.invoke(Method.java:564)
      at com.sun.javatest.regtest.agent.MainWrapper$MainThread.run(MainWrapper.java:127)
      at java.base/java.lang.Thread.run(Thread.java:832)

      JavaTest Message: Test threw exception: java.lang.RuntimeException: Test failed
      JavaTest Message: shutting down test

      STATUS:Failed.`main' threw exception: java.lang.RuntimeException: Test failed
      ----------rerun:(42/5722)*----------
      cd /scratch/opt/mach5/mesos/work_dir/slaves/47535081-0322-4d83-bb78-f7e11abb86d0-S43240/frameworks/1735e8a2-a1db-478c-8104-60c8b0af87dd-0196/executors/6b101995-f083-47ab-b173-5836143656aa/runs/4dec124f-892d-424f-990f-601078ee882d/testoutput/test-support/jtreg_open_test_jdk_jdk_desktop/java/awt/Mixing/AWT_Mixing/HierarchyBoundsListenerMixingTest && \\
      DISPLAY=:0 \\
      HOME=/tmp/sparky-temp-home-897674798241279246/user_home \\
      JDK8_HOME=/scratch/opt/mach5/mesos/work_dir/jib-master/install/jdk/15/36/bundles/linux-x64/jdk-15_linux-x64_bin.tar.gz/jdk-15 \\
      JIB_DATA_DIR=/scratch/opt/mach5/mesos/work_dir/jib-master \\
      JIB_HOME=/scratch/opt/mach5/mesos/work_dir/jib-master/install/com/oracle/java/jib/jib/3.0-SNAPSHOT/jib-3.0-SNAPSHOT-distribution.zip-1603987083/jib-3.0-SNAPSHOT-distribution \\
      JTREG_JOBS=1 \\
      JTREG_KEYWORDS='"headful & !printer"' \\
      JTREG_RETRY_COUNT=3 \\
      JTREG_STATUS=-status:error,fail \\
      JTREG_TIMEOUT_FACTOR=2 \\
      JTREG_VERBOSE=fail,error,time \\
      LC_ALL=C \\
      PATH=/bin:/usr/bin:/usr/sbin \\
      TEST_IMAGE_DIR=/scratch/opt/mach5/mesos/work_dir/jib-master/install/jdk-16+23-1418/linux-x64.test \\
      TEST_IMAGE_GRAAL_DIR=/scratch/opt/mach5/mesos/work_dir/jib-master/install/jdk-16+23-1418/linux-x64.test/hotspot/jtreg/graal \\
      CLASSPATH=/scratch/opt/mach5/mesos/work_dir/slaves/47535081-0322-4d83-bb78-f7e11abb86d0-S43240/frameworks/1735e8a2-a1db-478c-8104-60c8b0af87dd-0196/executors/6b101995-f083-47ab-b173-5836143656aa/runs/4dec124f-892d-424f-990f-601078ee882d/testoutput/test-support/jtreg_open_test_jdk_jdk_desktop/classes/java/awt/Mixing/AWT_Mixing/HierarchyBoundsListenerMixingTest.d:/scratch/opt/mach5/mesos/work_dir/jib-master/install/jdk-16+23-1418/src.full/open/test/jdk/java/awt/Mixing/AWT_Mixing:/scratch/opt/mach5/mesos/work_dir/jib-master/install/jtreg/5.1/b01/bundles/jtreg_bin-5.1.zip/jtreg/lib/javatest.jar:/scratch/opt/mach5/mesos/work_dir/jib-master/install/jtreg/5.1/b01/bundles/jtreg_bin-5.1.zip/jtreg/lib/jtreg.jar \\
          /scratch/opt/mach5/mesos/work_dir/jib-master/install/jdk-16+23-1418/linux-x64.jdk/jdk-16/bin/java \\
              -Dtest.vm.opts='-Xmx512m -XX:MaxRAMPercentage=25 -Djava.io.tmpdir=/scratch/opt/mach5/mesos/work_dir/slaves/47535081-0322-4d83-bb78-f7e11abb86d0-S43240/frameworks/1735e8a2-a1db-478c-8104-60c8b0af87dd-0196/executors/6b101995-f083-47ab-b173-5836143656aa/runs/4dec124f-892d-424f-990f-601078ee882d/testoutput/test-support/jtreg_open_test_jdk_jdk_desktop/tmp -ea -esa' \\
              -Dtest.tool.vm.opts='-J-Xmx512m -J-XX:MaxRAMPercentage=25 -J-Djava.io.tmpdir=/scratch/opt/mach5/mesos/work_dir/slaves/47535081-0322-4d83-bb78-f7e11abb86d0-S43240/frameworks/1735e8a2-a1db-478c-8104-60c8b0af87dd-0196/executors/6b101995-f083-47ab-b173-5836143656aa/runs/4dec124f-892d-424f-990f-601078ee882d/testoutput/test-support/jtreg_open_test_jdk_jdk_desktop/tmp -J-ea -J-esa' \\
              -Dtest.compiler.opts= \\
              -Dtest.java.opts= \\
              -Dtest.jdk=/scratch/opt/mach5/mesos/work_dir/jib-master/install/jdk-16+23-1418/linux-x64.jdk/jdk-16 \\
              -Dcompile.jdk=/scratch/opt/mach5/mesos/work_dir/jib-master/install/jdk-16+23-1418/linux-x64.jdk/jdk-16 \\
              -Dtest.timeout.factor=2.0 \\
              -Dtest.nativepath=/scratch/opt/mach5/mesos/work_dir/jib-master/install/jdk-16+23-1418/linux-x64.test/jdk/jtreg/native \\
              -Dtest.root=/scratch/opt/mach5/mesos/work_dir/jib-master/install/jdk-16+23-1418/src.full/open/test/jdk \\
              -Dtest.name=java/awt/Mixing/AWT_Mixing/HierarchyBoundsListenerMixingTest.java \\
              -Dtest.file=/scratch/opt/mach5/mesos/work_dir/jib-master/install/jdk-16+23-1418/src.full/open/test/jdk/java/awt/Mixing/AWT_Mixing/HierarchyBoundsListenerMixingTest.java \\
              -Dtest.src=/scratch/opt/mach5/mesos/work_dir/jib-master/install/jdk-16+23-1418/src.full/open/test/jdk/java/awt/Mixing/AWT_Mixing \\
              -Dtest.src.path=/scratch/opt/mach5/mesos/work_dir/jib-master/install/jdk-16+23-1418/src.full/open/test/jdk/java/awt/Mixing/AWT_Mixing \\
              -Dtest.classes=/scratch/opt/mach5/mesos/work_dir/slaves/47535081-0322-4d83-bb78-f7e11abb86d0-S43240/frameworks/1735e8a2-a1db-478c-8104-60c8b0af87dd-0196/executors/6b101995-f083-47ab-b173-5836143656aa/runs/4dec124f-892d-424f-990f-601078ee882d/testoutput/test-support/jtreg_open_test_jdk_jdk_desktop/classes/java/awt/Mixing/AWT_Mixing/HierarchyBoundsListenerMixingTest.d \\
              -Dtest.class.path=/scratch/opt/mach5/mesos/work_dir/slaves/47535081-0322-4d83-bb78-f7e11abb86d0-S43240/frameworks/1735e8a2-a1db-478c-8104-60c8b0af87dd-0196/executors/6b101995-f083-47ab-b173-5836143656aa/runs/4dec124f-892d-424f-990f-601078ee882d/testoutput/test-support/jtreg_open_test_jdk_jdk_desktop/classes/java/awt/Mixing/AWT_Mixing/HierarchyBoundsListenerMixingTest.d \\
              -Dtest.modules=java.desktop \\
              --add-modules java.desktop \\
              -Xmx512m \\
              -XX:MaxRAMPercentage=25 \\
              -Djava.io.tmpdir=/scratch/opt/mach5/mesos/work_dir/slaves/47535081-0322-4d83-bb78-f7e11abb86d0-S43240/frameworks/1735e8a2-a1db-478c-8104-60c8b0af87dd-0196/executors/6b101995-f083-47ab-b173-5836143656aa/runs/4dec124f-892d-424f-990f-601078ee882d/testoutput/test-support/jtreg_open_test_jdk_jdk_desktop/tmp \\
              -ea \\
              -esa \\
              -Djava.library.path=/scratch/opt/mach5/mesos/work_dir/jib-master/install/jdk-16+23-1418/linux-x64.test/jdk/jtreg/native \\
              com.sun.javatest.regtest.agent.MainWrapper /scratch/opt/mach5/mesos/work_dir/slaves/47535081-0322-4d83-bb78-f7e11abb86d0-S43240/frameworks/1735e8a2-a1db-478c-8104-60c8b0af87dd-0196/executors/6b101995-f083-47ab-b173-5836143656aa/runs/4dec124f-892d-424f-990f-601078ee882d/testoutput/test-support/jtreg_open_test_jdk_jdk_desktop/java/awt/Mixing/AWT_Mixing/HierarchyBoundsListenerMixingTest.d/main.0.jta
      result: Failed. Execution failed: `main' threw exception: java.lang.RuntimeException: Test failed


      test result: Failed. Execution failed: `main' threw exception: java.lang.RuntimeException: Test failed

        Attachments

          Activity

            People

            • Assignee:
              pbansal Pankaj Bansal
              Reporter:
              trebari Tejpal Rebari
            • Votes:
              0 Vote for this issue
              Watchers:
              3 Start watching this issue

              Dates

              • Created:
                Updated:
                Resolved: