Uploaded image for project: 'JDK'
  1. JDK
  2. JDK-8256642

[TEST_BUG] jdk/test/javax/sound/midi/MidiSystem/DefaultProperties.java failed

    XMLWordPrintable

    Details

    • Subcomponent:
    • Resolved In Build:
      b01
    • CPU:
      generic
    • OS:
      generic

      Description

      $ jtreg -va jdk/test/javax/sound/midi/MidiSystem/DefaultProperties.java

      command: main DefaultProperties
      reason: User specified action: run main/othervm DefaultProperties
      Mode: othervm [/othervm specified]
      elapsed time (seconds): 0.173
      configuration:
      STDOUT:
      type interface javax.sound.midi.Receiver failed: provider class should be 'xyz' but is 'null'!
      type interface javax.sound.midi.Receiver failed: instance name should be '123' but is 'null'!
      type interface javax.sound.midi.Transmitter failed: provider class should be 'xyz' but is 'null'!
      type interface javax.sound.midi.Transmitter failed: instance name should be '123' but is 'null'!
      type interface javax.sound.midi.Sequencer failed: provider class should be 'xyz' but is 'null'!
      type interface javax.sound.midi.Sequencer failed: instance name should be '123' but is 'null'!
      type interface javax.sound.midi.Synthesizer failed: provider class should be 'xyz' but is 'null'!
      type interface javax.sound.midi.Synthesizer failed: instance name should be '123' but is 'null'!
      STDERR:
      java.lang.Exception: Test failed
              at DefaultProperties.main(DefaultProperties.java:154)
              at sun.reflect.NativeMethodAccessorImpl.invoke0(Native Method)
              at sun.reflect.NativeMethodAccessorImpl.invoke(NativeMethodAccessorImpl.java:62)
              at sun.reflect.DelegatingMethodAccessorImpl.invoke(DelegatingMethodAccessorImpl.java:43)
              at java.lang.reflect.Method.invoke(Method.java:498)
              at com.sun.javatest.regtest.agent.MainWrapper$MainThread.run(MainWrapper.java:127)
              at java.lang.Thread.run(Thread.java:748)

      JavaTest Message: Test threw exception: java.lang.Exception: Test failed
      JavaTest Message: shutting down test

      STATUS:Failed.`main' threw exception: java.lang.Exception: Test failed


      jdk/test/javax/sound/sampled/AudioSystem/DefaultProperties.java has the same error.


        Attachments

          Issue Links

            Activity

              People

              Assignee:
              dongbohe Dongbo He
              Reporter:
              dongbohe Dongbo He
              Votes:
              0 Vote for this issue
              Watchers:
              2 Start watching this issue

                Dates

                Created:
                Updated:
                Resolved: