Uploaded image for project: 'JDK'
  1. JDK
  2. JDK-8258688

Build broken on Windows after JDK-8258134

    XMLWordPrintable

    Details

    • Type: Bug
    • Status: Closed
    • Priority: P1
    • Resolution: Duplicate
    • Affects Version/s: 16
    • Fix Version/s: 16
    • Component/s: hotspot
    • Labels:
      None

      Description

      [2020-12-18T13:37:32,132Z] zBarrierSetAssembler_x86.obj : error LNK2019: unresolved external symbol "int __cdecl vec_spill_helper(class CodeBuffer *,bool,int,int,unsigned int,class outputStream *)" (?vec_spill_helper@@YAHPEAVCodeBuffer@@_NHHIPEAVoutputStream@@@Z) referenced in function "public: __cdecl ZSaveLiveRegisters::ZSaveLiveRegisters(class MacroAssembler *,class ZLoadBarrierStubC2 *)" (??0ZSaveLiveRegisters@@QEAA@PEAVMacroAssembler@@PEAVZLoadBarrierStubC2@@@Z)
      [2020-12-18T13:37:32,132Z] Hint on symbols that are defined and could potentially match:
      [2020-12-18T13:37:32,132Z] "void __cdecl vec_spill_helper(class CodeBuffer *,bool,int,int,unsigned int,class outputStream *)" (?vec_spill_helper@@YAXPEAVCodeBuffer@@_NHHIPEAVoutputStream@@@Z)
      [2020-12-18T13:37:32,132Z] t:\workspace\build\windows-x64-open-debug\support\modules_libs\java.base\server\jvm.dll : fatal error LNK1120: 1 unresolved externals
      [2020-12-18T13:37:32,134Z] lib/CompileJvm.gmk:141: recipe for target '/cygdrive/t/workspace/build/windows-x64-open-debug/support/modules_libs/java.base/server/jvm.dll' failed
      [2020-12-18T13:37:32,134Z] make[3]: *** [/cygdrive/t/workspace/build/windows-x64-open-debug/support/modules_libs/java.base/server/jvm.dll] Error 1
      [2020-12-18T13:37:32,134Z] make[3]: *** Waiting for unfinished jobs....
      [2020-12-18T13:37:33,331Z] zBarrierSetAssembler_x86.obj : error LNK2019: unresolved external symbol "int __cdecl vec_spill_helper(class CodeBuffer *,bool,int,int,unsigned int,class outputStream *)" (?vec_spill_helper@@YAHPEAVCodeBuffer@@_NHHIPEAVoutputStream@@@Z) referenced in function "public: __cdecl ZSaveLiveRegisters::ZSaveLiveRegisters(class MacroAssembler *,class ZLoadBarrierStubC2 *)" (??0ZSaveLiveRegisters@@QEAA@PEAVMacroAssembler@@PEAVZLoadBarrierStubC2@@@Z)
      [2020-12-18T13:37:33,331Z] Hint on symbols that are defined and could potentially match:
      [2020-12-18T13:37:33,331Z] "void __cdecl vec_spill_helper(class CodeBuffer *,bool,int,int,unsigned int,class outputStream *)" (?vec_spill_helper@@YAXPEAVCodeBuffer@@_NHHIPEAVoutputStream@@@Z)
      [2020-12-18T13:37:33,331Z] t:\workspace\build\windows-x64-open-debug\hotspot\variant-server\libjvm\gtest\jvm.dll : fatal error LNK1120: 1 unresolved externals
      [2020-12-18T13:37:33,335Z] lib/CompileGtest.gmk:86: recipe for target '/cygdrive/t/workspace/build/windows-x64-open-debug/hotspot/variant-server/libjvm/gtest/jvm.dll' failed
      [2020-12-18T13:37:33,335Z] make[3]: *** [/cygdrive/t/workspace/build/windows-x64-open-debug/hotspot/variant-server/libjvm/gtest/jvm.dll] Error 1
      [2020-12-18T13:37:33,338Z] make[2]: *** [hotspot-server-libs] Error 2
      [2020-12-18T13:37:33,338Z] make[2]: *** Waiting for unfinished jobs....
      [2020-12-18T13:37:33,338Z] make/Main.gmk:252: recipe for target 'hotspot-server-libs' failed
      [2020-12-18T13:38:19,441Z] make[2]: INTERNAL: Exiting with 7 jobserver tokens available; should be 12!

        Attachments

          Issue Links

            Activity

              People

              Assignee:
              jiefu Jie Fu
              Reporter:
              thartmann Tobias Hartmann
              Votes:
              0 Vote for this issue
              Watchers:
              1 Start watching this issue

                Dates

                Created:
                Updated:
                Resolved: